{"text_format":"1","workbook":"xlsx","n_sheets":31,"sheets":["Master Schedule","11th_12th_Boys","Mens 30+","Womens A","Mens B","Mens A","High_School_Girls","9th_10th_Boys","Form_Data","3 team","4 Teams","5 team","6 Team Pool","6 Team Round","7 team","8 Teams","9 team","10 team","11 teams","12 team","13 team","14 team","15 team","16 team","17 team","18 team","19 Team","20 team(5 Pools of 4)","21 team","22 team","25 team"],"not_rendered":{"charts":0,"images":0,"macros":1,"external_links":0,"defined_names":83,"comments":0,"pivot_tables":0},"unopened":[],"bounds":{"document_bytes":16777216,"sheet_cells":100000,"rows_first":2000,"rows_last":500,"rows_between":2000,"halvings":0,"cell_chars":16384,"cell_head_chars":4096},"cells_cut":0,"cells_raw":0,"read":"whole","date_system":"1900"}

{"sheet":"Master Schedule","index":0,"n_rows":58,"n_cols":20,"rows_kept":58,"cut":false,"hidden":false,"merged":[[39,1,41,1],[0,2,0,7],[48,1,50,1],[51,1,53,1],[6,1,8,1],[1,2,1,7],[3,1,5,1],[54,1,56,1],[57,1,59,1],[0,11,0,18],[1,11,1,18],[45,1,47,1],[9,1,11,1],[12,1,14,1],[15,1,17,1],[18,1,20,1],[21,1,23,1],[42,1,44,1],[24,1,26,1],[27,1,29,1],[30,1,32,1],[33,1,35,1],[36,1,38,1],[3,10,5,10],[6,10,8,10],[9,10,11,10],[12,10,14,10],[15,10,17,10],[18,10,20,10],[21,10,23,10],[24,10,26,10],[27,10,29,10],[30,10,32,10],[33,10,35,10],[36,10,38,10],[39,10,41,10],[42,10,44,10],[45,10,47,10],[48,10,50,10],[51,10,53,10],[54,10,56,10],[57,10,59,10],[3,8,5,8],[6,8,8,8],[9,8,11,8],[12,8,14,8],[15,8,17,8],[18,8,20,8],[21,8,23,8],[24,8,26,8],[27,8,29,8],[30,8,32,8],[33,8,35,8],[36,8,38,8],[39,8,41,8],[42,8,44,8],[45,8,47,8],[48,8,50,8],[51,8,53,8],[54,8,56,8],[57,8,59,8],[3,19,5,19],[6,19,8,19],[9,19,11,19],[12,19,14,19],[15,19,17,19],[18,19,20,19],[21,19,23,19],[24,19,26,19],[27,19,29,19],[30,19,32,19],[33,19,35,19],[36,19,38,19],[39,19,41,19],[42,19,44,19],[45,19,47,19],[48,19,50,19],[51,19,53,19],[54,19,56,19],[57,19,59,19]]}
[null,null,"Sunday Games",null,null,null,null,null,null,null,null,"Sunday Games"]
[null,null,"Gym",null,null,null,null,null,null,null,null,"Fieldhouse"]
[null,null,1,2,3,4,5,6,null,null,null,7,8,9,10,11,12,13,14]
[null,"9:30",null,null,null,null,null,null,"9:30",null,"9:30",null,null,null,null,null,null,null,null,"9:30"]
[]
[]
[null,"10:00",null,null,null,null,null,null,"10:00",null,"10:00",null,null,null,null,null,null,null,null,"10:00"]
[]
[]
[null,"10:30","9th 10th Boys Pool A","9th 10th Boys Pool A","9th 10th Boys Pool B","9th 10th Boys Pool B","Mens B Pool A","Mens B Pool A","10:30",null,"10:30","Mens B Pool B","Mens B Pool B","Mens B Pool C","Mens B Pool C","Mens B Pool D","Mens B Pool D","Mens B Pool A",null,"10:30"]
[null,null,"Bayfield vs.","Size Matters vs.","Hayward vs.","Dream Team vs.","LBT 2.0 vs.","Mad Wombats vs.",null,null,null,"3 The Hard Way vs.","Barnum Rangers vs.","Donovan's Kingdom vs.","Flame vs.","Suns vs.","Super Soft Squad vs.","P.M.W. vs."]
[null,null,"We're just hockey players","Vanilla Oreo","We call game","BIG BUCKETS","South Shore","Slam City",null,null,null,"Come Get Some","Benchwarmer Rejects","Human Sized Players","GP GUNNERS","The Longshots","The Arc and Beyond","Reggie's Family"]
[null,"11:00","11th 12th Boys","High School Girls","High School Girls","Mens A Pool A","Mens A Pool A","Mens A Pool B","11:00",null,"11:00","Mens A Pool B","Womens A","Womens A","Mens 30+ Pool A","Mens 30+ Pool A","Mens 30+ Pool A","Mens 30+ Pool B","Mens 30+ Pool B","11:00"]
[null,null,"Minnesota Playmakers vs.","Bayfield vs.","Shockers vs.","Jackets vs.","Hillside Hoopers vs.","Buckets and Chill vs.",null,null,null,"Northface Hats/Mittens Inc. vs.","Trio of Trouble vs.","Peaked in High School vs.","Team Kastern vs.","PTown vs.","West Duluth vs.","Douglas County YMCA vs.","Team AARP vs."]
[null,null,"Vicious and Delicious","Esko","Swaggy Beasts","Grizzlies Superior","hoop squad","Life House",null,null,null,"Salo's Showcase","Huber Bucketz","Hoopers","Left Hookers","RJDM","Nispey Hustlers","R.N.E.B.","Brian SaunDers"]
[null,"11:30","Mens B Pool A","Mens B Pool A","Mens B Pool A","Mens B Pool B","Mens B Pool B","Mens B Pool C","11:30",null,"11:30","Mens B Pool C","Mens B Pool D","Mens B Pool D","9th 10th Boys Pool A","9th 10th Boys Pool A","9th 10th Boys Pool B","9th 10th Boys Pool B",null,"11:30"]
[null,null,"LBT 2.0 vs.","Mad Wombats vs.","P.M.W. vs.","3 The Hard Way vs.","Come Get Some vs.","Donovan's Kingdom vs.",null,null,null,"Human Sized Players vs.","Suns vs.","The Longshots vs.","Bayfield vs.","We're just hockey players vs.","Hayward vs.","We call game vs."]
[null,null,"Slam City","Reggie's Family","South Shore","Benchwarmer Rejects","Depot","GP GUNNERS",null,null,null,"Insulated Six Packs","The Arc and Beyond","TMNT","Vanilla Oreo","MVP","Dream Team","BIG BUCKETS"]
[null,"12:00","Mens 30+ Pool A","Mens 30+ Pool A","Mens 30+ Pool A","Mens 30+ Pool B","Mens 30+ Pool B","Womens A","12:00",null,"12:00","Womens A","Mens A Pool A","Mens A Pool A","Mens A Pool B","Mens A Pool B","High School Girls","High School Girls","11th 12th Boys","12:00"]
[null,null,"PTown vs.","Team Kastern vs.","Left Hookers vs.","Douglas County YMCA vs.","R.N.E.B. vs.","Trio of Trouble vs.",null,null,null,"Huber Bucketz vs.","Jackets vs.","Grizzlies Superior vs.","Buckets and Chill vs.","Life House vs.","Bayfield vs.","Esko vs.","Vicious and Delicious vs."]
[null,null,"West Duluth","RJDM","Nispey Hustlers","Brian SaunDers","Never Touched Net","Hoopers",null,null,null,"Smokin' Oldies","Hillside Hoopers","hoop squad","Northface Hats/Mittens Inc.","Salo's Showcase","Swaggy Beasts","Hot Shots","Southridge Panthers"]
[null,"12:30","9th 10th Boys Pool A","9th 10th Boys Pool A","9th 10th Boys Pool B","9th 10th Boys Pool B","Mens B Pool D","Mens B Pool D","12:30",null,"12:30","Mens B Pool C","Mens B Pool C","Mens B Pool B","Mens B Pool B","Mens B Pool A","Mens B Pool A","Mens B Pool A",null,"12:30"]
[null,null,"Vanilla Oreo vs.","Bayfield vs.","Hayward vs.","We call game vs.","Suns vs.","The Arc and Beyond vs.",null,null,null,"Donovan's Kingdom vs.","GP GUNNERS vs.","3 The Hard Way vs.","Benchwarmer Rejects vs.","Slam City vs.","Mad Wombats vs.","LBT 2.0 vs."]
[null,null,"MVP","Size Matters","BIG BUCKETS","Dream Team","Super Soft Squad","TMNT",null,null,null,"Flame","Insulated Six Packs","Barnum Rangers","Depot","South Shore","P.M.W.","Reggie's Family"]
[null,"1:00","11th 12th Boys","Mens A Pool A","Mens A Pool A","Mens A Pool B","Mens A Pool B","High School Girls","1:00",null,"1:00","High School Girls","Womens A","Womens A","Mens 30+ Pool A","Mens 30+ Pool A","Mens 30+ Pool A","Mens 30+ Pool B","Mens 30+ Pool B","1:00"]
[null,null,"Minnesota Playmakers vs.","Jackets vs.","Grizzlies Superior vs.","Buckets and Chill vs.","Life House vs.","Swaggy Beasts vs.",null,null,null,"Bayfield vs.","Hoopers vs.","Trio of Trouble vs.","West Duluth vs.","Left Hookers vs.","Team Kastern vs.","Brian SaunDers vs.","Douglas County YMCA vs."]
[null,null,"Southridge Panthers","hoop squad","Hillside Hoopers","Salo's Showcase","Northface Hats/Mittens Inc.","Hot Shots",null,null,null,"Shockers","Smokin' Oldies","Peaked in High School","RJDM","PTown","Nispey Hustlers","Never Touched Net","Team AARP"]
[null,"1:30","Mens B Pool C","Mens B Pool C","Mens B Pool D","Mens B Pool D","Mens B Pool B","Mens B Pool B","1:30",null,"1:30","Mens B Pool A","Mens B Pool A","Mens B Pool A","9th 10th Boys Pool A","9th 10th Boys Pool A",null,null,null,"1:30"]
[null,null,"Flame vs.","GP GUNNERS vs.","Super Soft Squad vs.","The Arc and Beyond vs.","Barnum Rangers vs.","Benchwarmer Rejects vs.",null,null,null,"LBT 2.0 vs.","Mad Wombats vs.","Reggie's Family vs.","Vanilla Oreo vs.","Size Matters vs."]
[null,null,"Insulated Six Packs","Human Sized Players","TMNT","The Longshots","Depot","Come Get Some",null,null,null,"P.M.W.","South Shore","Slam City","We're just hockey players","MVP"]
[null,"2:00","Womens A","Mens A Championship","Womens A","Mens 30+ Pool B","11th 12th Boys Playoffs","Mens 30+ Pool B","2:00",null,"2:00","Mens 30+ Pool A","Mens 30+ Pool A","Mens 30+ Pool A","High School Girls","High School Girls",null,null,null,"2:00"]
[null,null,"Peaked in High School vs.","Pool A #1 Seed vs.","Hoopers vs.","Team AARP vs.","#2 Seed vs.","Brian SaunDers vs.",null,null,null,"Left Hookers vs.","Team Kastern vs.","PTown vs.","Swaggy Beasts vs.","Shockers vs."]
[null,null,"Smokin' Oldies","Pool B #1 Seed","Huber Bucketz","Never Touched Net","#3 Seed","R.N.E.B.",null,null,null,"RJDM","West Duluth","Nispey Hustlers","Esko","Hot Shots"]
[null,"2:30","9th 10th Boys Pool A","9th 10th Boys Pool A","Mens B Pool B","Mens B Pool B","Mens B Pool C","Mens B Pool C","2:30",null,"2:30","Mens B Pool D","Mens B Pool D",null,null,null,null,null,null,"2:30"]
[null,null,"Size Matters vs.","Bayfield vs.","Barnum Rangers vs.","3 The Hard Way vs.","Flame vs.","Donovan's Kingdom vs.",null,null,null,"Super Soft Squad vs.","Suns vs."]
[null,null,"We're just hockey players","MVP","Come Get Some","Depot","Human Sized Players","Insulated Six Packs",null,null,null,"The Longshots","TMNT"]
[null,"3:00","High School Girls","11th 12th Boys Championship","High School Girls","Womens A","Womens A","Mens 30+ Pool B","3:00",null,"3:00","Mens 30+ Pool B",null,null,null,null,null,null,null,"3:00"]
[null,null,"Shockers vs.","#1 Seed vs.","Bayfield vs.","Peaked in High School vs.","Trio of Trouble vs.","Team AARP vs.",null,null,null,"Douglas County YMCA vs."]
[null,null,"Esko","Winner of Game 4","Hot Shots","Huber Bucketz","Smokin' Oldies","R.N.E.B.",null,null,null,"Never Touched Net"]
[null,"3:30","Mens B Playoffs","9th 10th Boys Championship",null,null,"Mens B Playoffs",null,"3:30",null,"3:30",null,null,null,null,null,null,null,null,"3:30"]
[null,null,"Pool C #1 Seed vs.","Pool A #1 Seed vs.",null,null,"Pool A #1 Seed vs."]
[null,null,"Pool D #1 Seed","Pool B #1 Seed",null,null,"Pool B #1 Seed"]
[null,"4:00",null,"Mens 30+ Championship",null,null,null,null,"4:00",null,"4:00",null,null,null,null,null,null,null,null,"4:00"]
[null,null,null,"Pool A #1 Seed vs."]
[null,null,null,"Pool B #1 Seed"]
[null,"4:30",null,"Mens B Championship",null,null,null,null,"4:30",null,"4:30",null,null,null,null,null,null,null,null,"4:30"]
[null,null,null,"Winner Game 43 vs."]
[null,null,null,"Winner Game 44"]
[null,"5:00",null,null,null,null,null,null,"5:00",null,"5:00",null,null,null,null,null,null,null,null,"5:00"]
[]
[]
[null,"5:30",null,null,null,null,null,null,"5:30",null,"5:30",null,null,null,null,null,null,null,null,"5:30"]
[]
[]
[null,"6:00",null,null,null,null,null,null,"6:00",null,"6:00",null,null,null,null,null,null,null,null,"6:00"]
[]
[]
[null,"6:30",null,null,null,null,null,null,"6:30",null,"6:30",null,null,null,null,null,null,null,null,"6:30"]

{"sheet":"11th_12th_Boys","index":1,"n_rows":17,"n_cols":9,"rows_kept":17,"cut":false,"hidden":false,"merged":[[15,4,15,6],[4,1,4,5],[4,6,4,8],[5,1,5,5],[5,6,5,8],[7,4,7,6],[12,4,12,6],[0,0,0,8],[1,0,1,8],[2,1,2,5],[2,6,2,8],[3,1,3,5],[3,6,3,8]]}
["11th and 12th Grade Boys"]
[]
["Team","Name",null,null,null,null,"Contact"]
[1,"Minnesota Playmakers",null,null,null,null,"Jordan Porter"]
[2,"Vicious and Delicious",null,null,null,null,"Shawn Traaholt"]
[3,"Southridge Panthers",null,null,null,null,"Kayden Palmi"]
[]
["Game",null,null,null,"Teams",null,null,"Court","Time"]
[1,1,"vs.",2,{"$f":"CONCATENATE((IF($A$4=B9,$B$4,IF($A$5=B9,$B$5,IF($A$6=B9,$B$6,IF($A$7=B9,$B$7,\"?\"))))))","v":"Minnesota Playmakers"},"vs.",{"$f":"CONCATENATE((IF($A$4=D9,$B$4,IF($A$5=D9,$B$5,IF($A$6=D9,$B$6,IF($A$7=D9,$B$7,\"?\"))))))","v":"Vicious and Delicious"},1,"11:00"]
[2,2,"vs.",3,{"$f":"CONCATENATE((IF($A$4=B10,$B$4,IF($A$5=B10,$B$5,IF($A$6=B10,$B$6,IF($A$7=B10,$B$7,\"?\"))))))","v":"Vicious and Delicious"},"vs.",{"$f":"CONCATENATE((IF($A$4=D10,$B$4,IF($A$5=D10,$B$5,IF($A$6=D10,$B$6,IF($A$7=D10,$B$7,\"?\"))))))","v":"Southridge Panthers"},14,"12:00"]
[3,1,"vs.",3,{"$f":"CONCATENATE((IF($A$4=B11,$B$4,IF($A$5=B11,$B$5,IF($A$6=B11,$B$6,IF($A$7=B11,$B$7,\"?\"))))))","v":"Minnesota Playmakers"},"vs.",{"$f":"CONCATENATE((IF($A$4=D11,$B$4,IF($A$5=D11,$B$5,IF($A$6=D11,$B$6,IF($A$7=D11,$B$7,\"?\"))))))","v":"Southridge Panthers"},1,"1:00"]
[]
["Game",null,null,null,"Semi-Final Game",null,null,"Court","Time"]
[4,null,null,null,"#2 Seed","vs.","#3 Seed",5,"2:00"]
[null,null,null,null,null,null,null,"2:30"]
["Game",null,null,null,"Championship Game",null,null,"Court","Time"]
[5,null,null,null,"#1 Seed","vs.","Winner of Game 4",2,"3:00"]

{"sheet":"Mens 30+","index":2,"n_rows":23,"n_cols":24,"rows_kept":23,"cut":false,"hidden":false,"merged":[[8,1,8,5],[8,6,8,8],[9,13,9,15],[10,4,10,6],[6,1,6,5],[6,6,6,8],[6,10,6,14],[6,15,6,17],[7,1,7,5],[7,6,7,8],[7,10,7,14],[7,15,7,17],[3,19,3,21],[4,1,4,5],[4,6,4,8],[4,10,4,14],[4,15,4,17],[5,1,5,5],[5,6,5,8],[5,10,5,14],[5,15,5,17],[2,1,2,5],[2,6,2,8],[2,10,2,14],[2,15,2,17],[3,1,3,5],[3,6,3,8],[3,10,3,14],[3,15,3,17],[0,0,0,8],[0,9,0,17],[0,18,0,23],[1,0,1,8],[1,9,1,17],[1,18,1,23]]}
["Mens 30+",null,null,null,null,null,null,null,null,{"$f":"A1","v":"Mens 30+"},null,null,null,null,null,null,null,null,{"$f":"A1","v":"Mens 30+"}]
["Pool A",null,null,null,null,null,null,null,null,"Pool B",null,null,null,null,null,null,null,null,"Playoffs"]
["Team","Name",null,null,null,null,"Contact",null,null,"Team","Name",null,null,null,null,"Contact"]
[1,"Team Kastern",null,null,null,null,"Cody Kastern",null,null,1,"Douglas County YMCA",null,null,null,null,"Scott Johnson",null,null,"Game","Championship Game",null,null,"Court","Time"]
[2,"Left Hookers",null,null,null,null,"Joe Kimmes",null,null,2,"Team AARP",null,null,null,null,"Jeff Rothamel",null,null,23,"Pool A #1 Seed","vs.","Pool B #1 Seed",2,"4:00"]
[3,"PTown",null,null,null,null,"Jesse Smith",null,null,3,"Brian SaunDers",null,null,null,null,"Chad Stigsell"]
[4,"West Duluth",null,null,null,null,"Kyle Scanlon",null,null,4,"R.N.E.B.",null,null,null,null,"Gary Moe"]
[5,"Nispey Hustlers",null,null,null,null,"Justin Stone",null,null,5,"Never Touched Net",null,null,null,null,"Brian Rink"]
[6,"RJDM",null,null,null,null,"Richard Trautline"]
[null,null,null,null,null,null,null,null,null,"Game",null,null,null,"Teams",null,null,"Court","Time"]
["Game",null,null,null,"Teams",null,null,"Court","Time",13,1,"vs.",4,{"$f":"CONCATENATE((IF($J$4=K11,$K$4,IF($J$5=K11,$K$5,IF($J$6=K11,$K$6,IF($J$7=K11,$K$7,IF($J$8=K11,$K$8)))))))","v":"Douglas County YMCA"},"vs.",{"$f":"CONCATENATE((IF($J$4=M11,$K$4,IF($J$5=M11,$K$5,IF($J$6=M11,$K$6,IF($J$7=M11,$K$7,IF($J$8=M11,$K$8)))))))","v":"R.N.E.B."},13,"11:00"]
[1,1,"vs.",2,{"$f":"CONCATENATE((IF($A$4=B12,$B$4,IF($A$5=B12,$B$5,IF($A$6=B12,$B$6,IF($A$7=B12,$B$7,IF($A$8=B12,$B$8,IF($A$9=B12,$B$9))))))))","v":"Team Kastern"},"vs.",{"$f":"CONCATENATE((IF($A$4=D12,$B$4,IF($A$5=D12,$B$5,IF($A$6=D12,$B$6,IF($A$7=D12,$B$7,IF($A$8=D12,$B$8,IF($A$9=D12,$B$9))))))))","v":"Left Hookers"},10,"11:00",14,2,"vs.",3,{"$f":"CONCATENATE((IF($J$4=K12,$K$4,IF($J$5=K12,$K$5,IF($J$6=K12,$K$6,IF($J$7=K12,$K$7,IF($J$8=K12,$K$8)))))))","v":"Team AARP"},"vs.",{"$f":"CONCATENATE((IF($J$4=M12,$K$4,IF($J$5=M12,$K$5,IF($J$6=M12,$K$6,IF($J$7=M12,$K$7,IF($J$8=M12,$K$8)))))))","v":"Brian SaunDers"},14,"11:00"]
[2,3,"vs.",6,{"$f":"CONCATENATE((IF($A$4=B13,$B$4,IF($A$5=B13,$B$5,IF($A$6=B13,$B$6,IF($A$7=B13,$B$7,IF($A$8=B13,$B$8)))))))","v":"PTown"},"vs.",{"$f":"CONCATENATE((IF($A$4=D13,$B$4,IF($A$5=D13,$B$5,IF($A$6=D13,$B$6,IF($A$7=D13,$B$7,IF($A$8=D13,$B$8,IF($A$9=D13,$B$9))))))))","v":"RJDM"},11,"11:00",15,1,"vs.",3,"Douglas County YMCA","vs.","Brian SaunDers",4,"12:00"]
[3,4,"vs.",5,"West Duluth","vs.","Nispey Hustlers",12,"11:00",16,4,"vs.",5,"R.N.E.B.","vs.","Never Touched Net",5,"12:00"]
[4,3,"vs.",4,"PTown","vs.","West Duluth",1,"12:00",17,3,"vs.",5,"Brian SaunDers","vs.","Never Touched Net",13,"1:00"]
[5,1,"vs.",6,"Team Kastern","vs.","RJDM",2,"12:00",18,1,"vs.",2,"Douglas County YMCA","vs.","Team AARP",14,"1:00"]
[6,2,"vs.",5,"Left Hookers","vs.","Nispey Hustlers",3,"12:00",19,2,"vs.",5,"Team AARP","vs.","Never Touched Net",4,"2:00"]
[7,4,"vs.",6,"West Duluth","vs.","RJDM",10,"1:00",20,3,"vs.",4,"Brian SaunDers","vs.","R.N.E.B.",6,"2:00"]
[8,2,"vs.",3,"Left Hookers","vs.","PTown",11,"1:00",21,2,"vs.",4,"Team AARP","vs.","R.N.E.B.",6,"3:00"]
[9,1,"vs.",5,"Team Kastern","vs.","Nispey Hustlers",12,"1:00",22,1,"vs.",5,"Douglas County YMCA","vs.","Never Touched Net",7,"3:00"]
[10,1,"vs.",4,"Team Kastern","vs.","West Duluth",8,"2:00"]
[11,3,"vs.",5,"PTown","vs.","Nispey Hustlers",9,"2:00"]
[12,2,"vs.",6,"Left Hookers","vs.","RJDM",7,"2:00"]

{"sheet":"Womens A","index":3,"n_rows":20,"n_cols":9,"rows_kept":20,"cut":false,"hidden":false,"merged":[[7,1,7,5],[7,6,7,8],[9,4,9,6],[4,1,4,5],[4,6,4,8],[5,1,5,5],[5,6,5,8],[6,1,6,5],[6,6,6,8],[0,0,0,8],[1,0,1,8],[2,1,2,5],[2,6,2,8],[3,1,3,5],[3,6,3,8]]}
["Womens A"]
[]
["Team","Name",null,null,null,null,"Contact"]
[1,"Trio of Trouble",null,null,null,null,"Ines Chandler"]
[2,"Peaked in High School",null,null,null,null,"Ellie Leadstom"]
[3,"Hoopers",null,null,null,null,"Meghan Aho"]
[4,"Huber Bucketz",null,null,null,null,"Alison Huber"]
[5,"Smokin' Oldies",null,null,null,null,"Lanee Lyons"]
[]
["Game",null,null,null,"Teams",null,null,"Court","Time"]
[1,1,"vs.",4,{"$f":"CONCATENATE((IF($A$4=B11,$B$4,IF($A$5=B11,$B$5,IF($A$6=B11,$B$6,IF($A$7=B11,$B$7,IF($A$8=B11,$B$8)))))))","v":"Trio of Trouble"},"vs.",{"$f":"CONCATENATE((IF($A$4=D11,$B$4,IF($A$5=D11,$B$5,IF($A$6=D11,$B$6,IF($A$7=D11,$B$7,IF($A$8=D11,$B$8)))))))","v":"Huber Bucketz"},8,"11:00"]
[2,2,"vs.",3,{"$f":"CONCATENATE((IF($A$4=B12,$B$4,IF($A$5=B12,$B$5,IF($A$6=B12,$B$6,IF($A$7=B12,$B$7,IF($A$8=B12,$B$8)))))))","v":"Peaked in High School"},"vs.",{"$f":"CONCATENATE((IF($A$4=D12,$B$4,IF($A$5=D12,$B$5,IF($A$6=D12,$B$6,IF($A$7=D12,$B$7,IF($A$8=D12,$B$8)))))))","v":"Hoopers"},9,"11:00"]
[3,1,"vs.",3,"Trio of Trouble","vs.","Hoopers",6,"12:00"]
[4,4,"vs.",5,"Huber Bucketz","vs.","Smokin' Oldies",7,"12:00"]
[5,3,"vs.",5,"Hoopers","vs.","Smokin' Oldies",8,"1:00"]
[6,1,"vs.",2,"Trio of Trouble","vs.","Peaked in High School",9,"1:00"]
[7,2,"vs.",5,"Peaked in High School","vs.","Smokin' Oldies",1,"2:00"]
[8,3,"vs.",4,"Hoopers","vs.","Huber Bucketz",3,"2:00"]
[9,2,"vs.",4,"Peaked in High School","vs.","Huber Bucketz",4,"3:00"]
[10,1,"vs.",5,"Trio of Trouble","vs.","Smokin' Oldies",5,"3:00"]

{"sheet":"Mens B","index":4,"n_rows":23,"n_cols":42,"rows_kept":23,"cut":false,"hidden":false,"merged":[[10,4,10,6],[7,28,7,32],[7,33,7,35],[7,37,7,39],[8,1,8,5],[8,6,8,8],[9,13,9,15],[9,22,9,24],[9,31,9,33],[7,1,7,5],[7,6,7,8],[7,10,7,14],[7,15,7,17],[7,19,7,23],[7,24,7,26],[5,28,5,32],[5,33,5,35],[6,1,6,5],[6,6,6,8],[6,10,6,14],[6,15,6,17],[6,19,6,23],[6,24,6,26],[6,28,6,32],[6,33,6,35],[5,1,5,5],[5,6,5,8],[5,10,5,14],[5,15,5,17],[5,19,5,23],[5,24,5,26],[3,37,3,39],[4,1,4,5],[4,6,4,8],[4,10,4,14],[4,15,4,17],[4,19,4,23],[4,24,4,26],[4,28,4,32],[4,33,4,35],[2,28,2,32],[2,33,2,35],[3,1,3,5],[3,6,3,8],[3,10,3,14],[3,15,3,17],[3,19,3,23],[3,24,3,26],[3,28,3,32],[3,33,3,35],[2,1,2,5],[2,6,2,8],[2,10,2,14],[2,15,2,17],[2,19,2,23],[2,24,2,26],[0,0,0,8],[0,9,0,17],[0,18,0,26],[0,27,0,35],[0,36,0,41],[1,0,1,8],[1,9,1,17],[1,18,1,26],[1,27,1,35],[1,36,1,41]]}
["18 - 30 Mens B",null,null,null,null,null,null,null,null,{"$f":"A1","v":"18 - 30 Mens B"},null,null,null,null,null,null,null,null,{"$f":"A1","v":"18 - 30 Mens B"},null,null,null,null,null,null,null,null,{"$f":"A1","v":"18 - 30 Mens B"},null,null,null,null,null,null,null,null,{"$f":"A1","v":"18 - 30 Mens B"}]
["Pool A",null,null,null,null,null,null,null,null,"Pool B",null,null,null,null,null,null,null,null,"Pool C",null,null,null,null,null,null,null,null,"Pool D",null,null,null,null,null,null,null,null,"Playoffs"]
["Team","Name",null,null,null,null,"Contact",null,null,"Team","Name",null,null,null,null,"Contact",null,null,"Team","Name",null,null,null,null,"Contact",null,null,"Team","Name",null,null,null,null,"Contact"]
[1,"LBT 2.0",null,null,null,null,"Michael Butera",null,null,1,"3 The Hard Way",null,null,null,null,"Daniel Horst",null,null,1,"Donovan's Kingdom",null,null,null,null,"Donovan Luoma",null,null,1,"Suns",null,null,null,null,"Gabe Mayfield",null,null,"Game","Semi-Final Games",null,null,"Court","Time"]
[2,"Mad Wombats",null,null,null,null,"Logan Tone",null,null,2,"Barnum Rangers",null,null,null,null,"Ryne Seibert",null,null,2,"Flame",null,null,null,null,"Isaac Brown",null,null,2,"Super Soft Squad",null,null,null,null,"Seth Egge",null,null,43,"Pool A #1 Seed","vs.","Pool B #1 Seed",5,"3:30"]
[3,"P.M.W.",null,null,null,null,"Ray Gordon",null,null,3,"Benchwarmer Rejects",null,null,null,null,"Jordan Daml",null,null,3,"GP GUNNERS",null,null,null,null,"Trusen Gordon",null,null,3,"The Arc and Beyond",null,null,null,null,"Jimmy Lamoreaux",null,null,44,"Pool C #1 Seed","vs.","Pool D #1 Seed",1,"3:30"]
[4,"Reggie's Family",null,null,null,null,"Kendall Abrahamzon",null,null,4,"Come Get Some",null,null,null,null,"Brian DeMar",null,null,4,"Human Sized Players",null,null,null,null,"Anthony Bassamore",null,null,4,"The Longshots",null,null,null,null,"David Pinkoski"]
[5,"Slam City",null,null,null,null,"Andre James",null,null,5,"Depot",null,null,null,null,"Erik Gulbrandson",null,null,5,"Insulated Six Packs",null,null,null,null,"Matt Peterson",null,null,5,"TMNT",null,null,null,null,"Justin Smith",null,null,"Game","Championship Game",null,null,"Court","Time"]
[6,"South Shore",null,null,null,null,"Al Pearson",null,null,null,null,null,null,null,null,null,null,null,null,null,null,null,null,null,null,null,null,null,null,null,null,null,null,null,null,null,45,"Winner Game 43","vs.","Winner Game 44",2,"4:30"]
[null,null,null,null,null,null,null,null,null,"Game",null,null,null,"Teams",null,null,"Court","Time","Game",null,null,null,"Teams",null,null,"Court","Time","Game",null,null,null,"Teams",null,null,"Court","Time"]
["Game",null,null,null,"Teams",null,null,"Court","Time",13,1,"vs.",4,{"$f":"CONCATENATE((IF($J$4=K11,$K$4,IF($J$5=K11,$K$5,IF($J$6=K11,$K$6,IF($J$7=K11,$K$7,IF($J$8=K11,$K$8)))))))","v":"3 The Hard Way"},"vs.",{"$f":"CONCATENATE((IF($J$4=M11,$K$4,IF($J$5=M11,$K$5,IF($J$6=M11,$K$6,IF($J$7=M11,$K$7,IF($J$8=M11,$K$8)))))))","v":"Come Get Some"},7,"10:30",23,1,"vs.",4,{"$f":"CONCATENATE((IF($S$4=T11,$T$4,IF($S$5=T11,$T$5,IF($S$6=T11,$T$6,IF($S$7=T11,$T$7,IF($S$8=T11,$T$8)))))))","v":"Donovan's Kingdom"},"vs.",{"$f":"CONCATENATE((IF($S$4=V11,$T$4,IF($S$5=V11,$T$5,IF($S$6=V11,$T$6,IF($S$7=V11,$T$7,IF($S$8=V11,$T$8)))))))","v":"Human Sized Players"},9,"10:30",33,1,"vs.",4,{"$f":"CONCATENATE((IF($AB$4=AC11,$AC$4,IF($AB$5=AC11,$AC$5,IF($AB$6=AC11,$AC$6,IF($AB$7=AC11,$AC$7,IF($AB$8=AC11,$AC$8)))))))","v":"Suns"},"vs.",{"$f":"CONCATENATE((IF($AB$4=AE11,$AC$4,IF($AB$5=AE11,$AC$5,IF($AB$6=AE11,$AC$6,IF($AB$7=AE11,$AC$7,IF($AB$8=AE11,$AC$8)))))))","v":"The Longshots"},11,"10:30"]
[1,1,"vs.",6,{"$f":"CONCATENATE((IF($A$4=B12,$B$4,IF($A$5=B12,$B$5,IF($A$6=B12,$B$6,IF($A$7=B12,$B$7,IF($A$8=B12,$B$8,IF($A$9=B12,$B$9))))))))","v":"LBT 2.0"},"vs.",{"$f":"CONCATENATE((IF($A$4=D12,$B$4,IF($A$5=D12,$B$5,IF($A$6=D12,$B$6,IF($A$7=D12,$B$7,IF($A$8=D12,$B$8,IF($A$9=D12,$B$9))))))))","v":"South Shore"},5,"10:30",14,2,"vs.",3,{"$f":"CONCATENATE((IF($J$4=K12,$K$4,IF($J$5=K12,$K$5,IF($J$6=K12,$K$6,IF($J$7=K12,$K$7,IF($J$8=K12,$K$8)))))))","v":"Barnum Rangers"},"vs.",{"$f":"CONCATENATE((IF($J$4=M12,$K$4,IF($J$5=M12,$K$5,IF($J$6=M12,$K$6,IF($J$7=M12,$K$7,IF($J$8=M12,$K$8)))))))","v":"Benchwarmer Rejects"},8,"10:30",24,2,"vs.",3,{"$f":"CONCATENATE((IF($S$4=T12,$T$4,IF($S$5=T12,$T$5,IF($S$6=T12,$T$6,IF($S$7=T12,$T$7,IF($S$8=T12,$T$8)))))))","v":"Flame"},"vs.",{"$f":"CONCATENATE((IF($S$4=V12,$T$4,IF($S$5=V12,$T$5,IF($S$6=V12,$T$6,IF($S$7=V12,$T$7,IF($S$8=V12,$T$8)))))))","v":"GP GUNNERS"},10,"10:30",34,2,"vs.",3,{"$f":"CONCATENATE((IF($AB$4=AC12,$AC$4,IF($AB$5=AC12,$AC$5,IF($AB$6=AC12,$AC$6,IF($AB$7=AC12,$AC$7,IF($AB$8=AC12,$AC$8)))))))","v":"Super Soft Squad"},"vs.",{"$f":"CONCATENATE((IF($AB$4=AE12,$AC$4,IF($AB$5=AE12,$AC$5,IF($AB$6=AE12,$AC$6,IF($AB$7=AE12,$AC$7,IF($AB$8=AE12,$AC$8)))))))","v":"The Arc and Beyond"},12,"10:30"]
[2,2,"vs.",5,{"$f":"CONCATENATE((IF($A$4=B13,$B$4,IF($A$5=B13,$B$5,IF($A$6=B13,$B$6,IF($A$7=B13,$B$7,IF($A$8=B13,$B$8)))))))","v":"Mad Wombats"},"vs.",{"$f":"CONCATENATE((IF($A$4=D13,$B$4,IF($A$5=D13,$B$5,IF($A$6=D13,$B$6,IF($A$7=D13,$B$7,IF($A$8=D13,$B$8,IF($A$9=D13,$B$9))))))))","v":"Slam City"},6,"10:30",15,1,"vs.",3,"3 The Hard Way","vs.","Benchwarmer Rejects",4,"11:30",25,1,"vs.",3,"Donovan's Kingdom","vs.","GP GUNNERS",6,"11:30",35,1,"vs.",3,"Suns","vs.","The Arc and Beyond",8,"11:30"]
[3,3,"vs.",4,"P.M.W.","vs.","Reggie's Family",13,"10:30",16,4,"vs.",5,"Come Get Some","vs.","Depot",5,"11:30",26,4,"vs.",5,"Human Sized Players","vs.","Insulated Six Packs",7,"11:30",36,4,"vs.",5,"The Longshots","vs.","TMNT",9,"11:30"]
[4,1,"vs.",5,"LBT 2.0","vs.","Slam City",1,"11:30",17,3,"vs.",5,"Benchwarmer Rejects","vs.","Depot",10,"12:30",27,3,"vs.",5,"GP GUNNERS","vs.","Insulated Six Packs",8,"12:30",37,3,"vs.",5,"The Arc and Beyond","vs.","TMNT",6,"12:30"]
[5,2,"vs.",4,"Mad Wombats","vs.","Reggie's Family",2,"11:30",18,1,"vs.",2,"3 The Hard Way","vs.","Barnum Rangers",9,"12:30",28,1,"vs.",2,"Donovan's Kingdom","vs.","Flame",7,"12:30",38,1,"vs.",2,"Suns","vs.","Super Soft Squad",5,"12:30"]
[6,3,"vs.",6,"P.M.W.","vs.","South Shore",3,"11:30",19,2,"vs.",5,"Barnum Rangers","vs.","Depot",5,"1:30",29,2,"vs.",5,"Flame","vs.","Insulated Six Packs",1,"1:30",39,2,"vs.",5,"Super Soft Squad","vs.","TMNT",3,"1:30"]
[7,1,"vs.",4,"LBT 2.0","vs.","Reggie's Family",13,"12:30",20,3,"vs.",4,"Benchwarmer Rejects","vs.","Come Get Some",6,"1:30",30,3,"vs.",4,"GP GUNNERS","vs.","Human Sized Players",2,"1:30",40,3,"vs.",4,"The Arc and Beyond","vs.","The Longshots",4,"1:30"]
[8,2,"vs.",3,"Mad Wombats","vs.","P.M.W.",12,"12:30",21,2,"vs.",4,"Barnum Rangers","vs.","Come Get Some",3,"2:30",31,2,"vs.",4,"Flame","vs.","Human Sized Players",5,"2:30",41,2,"vs.",4,"Super Soft Squad","vs.","The Longshots",7,"2:30"]
[9,5,"vs.",6,"Slam City","vs.","South Shore",11,"12:30",22,1,"vs.",5,"3 The Hard Way","vs.","Depot",4,"2:30",32,1,"vs.",5,"Donovan's Kingdom","vs.","Insulated Six Packs",6,"2:30",42,1,"vs.",5,"Suns","vs.","TMNT",8,"2:30"]
[10,1,"vs.",3,"LBT 2.0","vs.","P.M.W.",7,"1:30"]
[11,2,"vs.",6,"Mad Wombats","vs.","South Shore",8,"1:30"]
[12,4,"vs.",5,"Reggie's Family","vs.","Slam City",9,"1:30"]

{"sheet":"Mens A","index":5,"n_rows":15,"n_cols":24,"rows_kept":15,"cut":false,"hidden":false,"merged":[[6,1,6,5],[6,6,6,8],[6,10,6,14],[6,15,6,17],[8,4,8,6],[8,13,8,15],[3,19,3,21],[4,1,4,5],[4,6,4,8],[4,10,4,14],[4,15,4,17],[5,1,5,5],[5,6,5,8],[5,10,5,14],[5,15,5,17],[2,1,2,5],[2,6,2,8],[2,10,2,14],[2,15,2,17],[3,1,3,5],[3,6,3,8],[3,10,3,14],[3,15,3,17],[0,0,0,8],[0,9,0,17],[0,18,0,23],[1,0,1,8],[1,9,1,17],[1,18,1,23]]}
["18-30 Mens A",null,null,null,null,null,null,null,null,{"$f":"A1","v":"18-30 Mens A"},null,null,null,null,null,null,null,null,{"$f":"A1","v":"18-30 Mens A"}]
["Pool A",null,null,null,null,null,null,null,null,"Pool B",null,null,null,null,null,null,null,null,"Playoffs"]
["Team","Name",null,null,null,null,"Contact",null,null,"Team","Name",null,null,null,null,"Contact"]
[1,"Jackets",null,null,null,null,"Shaq Coleman",null,null,1,"Buckets and Chill",null,null,null,null,"Zach Rajala",null,null,"Game","Championship Game",null,null,"Court","Time"]
[2,"Grizzlies Superior",null,null,null,null,"Eagan Johnson",null,null,2,"Life House",null,null,null,null,"Gabe Mayfield",null,null,13,"Pool A #1 Seed","vs.","Pool B #1 Seed",2,"2:00"]
[3,"Hillside Hoopers",null,null,null,null,"Phil/Tone Hooper",null,null,3,"Northface Hats/Mittens Inc.",null,null,null,null,"Joel Lindberg"]
[4,"hoop squad",null,null,null,null,"joseph bower",null,null,4,"Salo's Showcase",null,null,null,null,"Luke Salo"]
[]
["Game",null,null,null,"Teams",null,null,"Court","Time","Game",null,null,null,"Teams",null,null,"Court","Time"]
[1,1,"vs.",2,{"$f":"CONCATENATE((IF($A$4=B10,$B$4,IF($A$5=B10,$B$5,IF($A$6=B10,$B$6,IF($A$7=B10,$B$7,\"?\"))))))","v":"Jackets"},"vs.",{"$f":"CONCATENATE((IF($A$4=D10,$B$4,IF($A$5=D10,$B$5,IF($A$6=D10,$B$6,IF($A$7=D10,$B$7,\"?\"))))))","v":"Grizzlies Superior"},4,"11:00",7,1,"vs.",2,{"$f":"CONCATENATE((IF($J$4=K10,$K$4,IF($J$5=K10,$K$5,IF($J$6=K10,$K$6,IF($J$7=K10,$K$7,\"?\"))))))","v":"Buckets and Chill"},"vs.",{"$f":"CONCATENATE((IF($J$4=M10,$K$4,IF($J$5=M10,$K$5,IF($J$6=M10,$K$6,IF($J$7=M10,$K$7,\"?\"))))))","v":"Life House"},6,"11:00"]
[2,3,"vs.",4,{"$f":"CONCATENATE((IF($A$4=B11,$B$4,IF($A$5=B11,$B$5,IF($A$6=B11,$B$6,IF($A$7=B11,$B$7,\"?\"))))))","v":"Hillside Hoopers"},"vs.","hoop squad",5,"11:00",8,3,"vs.",4,{"$f":"CONCATENATE((IF($J$4=K11,$K$4,IF($J$5=K11,$K$5,IF($J$6=K11,$K$6,IF($J$7=K11,$K$7,\"?\"))))))","v":"Northface Hats/Mittens Inc."},"vs.","Salo's Showcase",7,"11:00"]
[3,1,"vs.",3,"Jackets","vs.","Hillside Hoopers",8,"12:00",9,1,"vs.",3,"Buckets and Chill","vs.","Northface Hats/Mittens Inc.",10,"12:00"]
[4,2,"vs.",4,"Grizzlies Superior","vs.","hoop squad",9,"12:00",10,2,"vs.",4,"Life House","vs.","Salo's Showcase",11,"12:00"]
[5,1,"vs.",4,"Jackets","vs.","hoop squad",2,"1:00",11,1,"vs.",4,"Buckets and Chill","vs.","Salo's Showcase",4,"1:00"]
[6,2,"vs.",3,"Grizzlies Superior","vs.","Hillside Hoopers",3,"1:00",12,2,"vs.",3,"Life House","vs.","Northface Hats/Mittens Inc.",5,"1:00"]

{"sheet":"High_School_Girls","index":6,"n_rows":20,"n_cols":9,"rows_kept":20,"cut":false,"hidden":false,"merged":[[7,1,7,5],[7,6,7,8],[9,4,9,6],[4,1,4,5],[4,6,4,8],[5,1,5,5],[5,6,5,8],[6,1,6,5],[6,6,6,8],[0,0,0,8],[1,0,1,8],[2,1,2,5],[2,6,2,8],[3,1,3,5],[3,6,3,8]]}
["9th - 12th Grade High School Girls"]
[]
["Team","Name",null,null,null,null,"Contact"]
[1,"Bayfield",null,null,null,null,"Brandon Gordon"]
[2,"Shockers",null,null,null,null,"Paige Leinon"]
[3,"Swaggy Beasts",null,null,null,null,"Kaylee Baker"]
[4,"Esko",null,null,null,null,"Michelle Kuklinski"]
[5,"Hot Shots",null,null,null,null,"Kristina Pederson"]
[]
["Game",null,null,null,"Teams",null,null,"Court","Time"]
[1,1,"vs.",4,{"$f":"CONCATENATE((IF($A$4=B11,$B$4,IF($A$5=B11,$B$5,IF($A$6=B11,$B$6,IF($A$7=B11,$B$7,IF($A$8=B11,$B$8)))))))","v":"Bayfield"},"vs.",{"$f":"CONCATENATE((IF($A$4=D11,$B$4,IF($A$5=D11,$B$5,IF($A$6=D11,$B$6,IF($A$7=D11,$B$7,IF($A$8=D11,$B$8)))))))","v":"Esko"},2,"11:00"]
[2,2,"vs.",3,{"$f":"CONCATENATE((IF($A$4=B12,$B$4,IF($A$5=B12,$B$5,IF($A$6=B12,$B$6,IF($A$7=B12,$B$7,IF($A$8=B12,$B$8)))))))","v":"Shockers"},"vs.",{"$f":"CONCATENATE((IF($A$4=D12,$B$4,IF($A$5=D12,$B$5,IF($A$6=D12,$B$6,IF($A$7=D12,$B$7,IF($A$8=D12,$B$8)))))))","v":"Swaggy Beasts"},3,"11:00"]
[3,1,"vs.",3,"Bayfield","vs.","Swaggy Beasts",12,"12:00"]
[4,4,"vs.",5,"Esko","vs.","Hot Shots",13,"12:00"]
[5,3,"vs.",5,"Swaggy Beasts","vs.","Hot Shots",6,"1:00"]
[6,1,"vs.",2,"Bayfield","vs.","Shockers",7,"1:00"]
[7,2,"vs.",5,"Shockers","vs.","Hot Shots",11,"2:00"]
[8,3,"vs.",4,"Swaggy Beasts","vs.","Esko",10,"2:00"]
[9,2,"vs.",4,"Shockers","vs.","Esko",1,"3:00"]
[10,1,"vs.",5,"Bayfield","vs.","Hot Shots",3,"3:00"]

{"sheet":"9th_10th_Boys","index":7,"n_rows":20,"n_cols":24,"rows_kept":20,"cut":false,"hidden":false,"merged":[[8,13,8,15],[9,4,9,6],[6,1,6,5],[6,6,6,8],[6,10,6,14],[6,15,6,17],[7,1,7,5],[7,6,7,8],[3,19,3,21],[4,1,4,5],[4,6,4,8],[4,10,4,14],[4,15,4,17],[5,1,5,5],[5,6,5,8],[5,10,5,14],[5,15,5,17],[2,1,2,5],[2,6,2,8],[2,10,2,14],[2,15,2,17],[3,1,3,5],[3,6,3,8],[3,10,3,14],[3,15,3,17],[0,0,0,8],[0,9,0,17],[0,18,0,23],[1,0,1,8],[1,9,1,17],[1,18,1,23]]}
["9th and 10th Grade Boys",null,null,null,null,null,null,null,null,{"$f":"A1","v":"9th and 10th Grade Boys"},null,null,null,null,null,null,null,null,{"$f":"A1","v":"9th and 10th Grade Boys"}]
["Pool A",null,null,null,null,null,null,null,null,"Pool B",null,null,null,null,null,null,null,null,"Playoffs"]
["Team","Name",null,null,null,null,"Contact",null,null,"Team","Name",null,null,null,null,"Contact"]
[1,"Bayfield",null,null,null,null,"Brandon Gordon",null,null,1,"Hayward",null,null,null,null,"Cole Phillips",null,null,"Game","Championship Game",null,null,"Court","Time"]
[2,"Size Matters",null,null,null,null,"Noah Gunderson",null,null,2,"We call game",null,null,null,null,"Michael Pullen",null,null,17,"Pool A #1 Seed","vs.","Pool B #1 Seed",2,"3:30"]
[3,"Vanilla Oreo",null,null,null,null,"Mason Maki",null,null,3,"Dream Team",null,null,null,null,"Logan Peterson"]
[4,"We're just hockey players",null,null,null,null,"Carter Pettit",null,null,4,"BIG BUCKETS",null,null,null,null,"Mason Dupree"]
[5,"MVP",null,null,null,null,"Rolando Ellis"]
[null,null,null,null,null,null,null,null,null,"Game",null,null,null,"Teams",null,null,"Court","Time"]
["Game",null,null,null,"Teams",null,null,"Court","Time",11,1,"vs.",2,{"$f":"CONCATENATE((IF($J$4=K10,$K$4,IF($J$5=K10,$K$5,IF($J$6=K10,$K$6,IF($J$7=K10,$K$7,\"?\"))))))","v":"Hayward"},"vs.",{"$f":"CONCATENATE((IF($J$4=M10,$K$4,IF($J$5=M10,$K$5,IF($J$6=M10,$K$6,IF($J$7=M10,$K$7,\"?\"))))))","v":"We call game"},3,"10:30"]
[1,1,"vs.",4,{"$f":"CONCATENATE((IF($A$4=B11,$B$4,IF($A$5=B11,$B$5,IF($A$6=B11,$B$6,IF($A$7=B11,$B$7,IF($A$8=B11,$B$8)))))))","v":"Bayfield"},"vs.",{"$f":"CONCATENATE((IF($A$4=D11,$B$4,IF($A$5=D11,$B$5,IF($A$6=D11,$B$6,IF($A$7=D11,$B$7,IF($A$8=D11,$B$8)))))))","v":"We're just hockey players"},1,"10:30",12,3,"vs.",4,{"$f":"CONCATENATE((IF($J$4=K11,$K$4,IF($J$5=K11,$K$5,IF($J$6=K11,$K$6,IF($J$7=K11,$K$7,\"?\"))))))","v":"Dream Team"},"vs.",{"$f":"CONCATENATE((IF($J$4=M11,$K$4,IF($J$5=M11,$K$5,IF($J$6=M11,$K$6,IF($J$7=M11,$K$7,\"?\"))))))","v":"BIG BUCKETS"},4,"10:30"]
[2,2,"vs.",3,{"$f":"CONCATENATE((IF($A$4=B12,$B$4,IF($A$5=B12,$B$5,IF($A$6=B12,$B$6,IF($A$7=B12,$B$7,IF($A$8=B12,$B$8)))))))","v":"Size Matters"},"vs.",{"$f":"CONCATENATE((IF($A$4=D12,$B$4,IF($A$5=D12,$B$5,IF($A$6=D12,$B$6,IF($A$7=D12,$B$7,IF($A$8=D12,$B$8)))))))","v":"Vanilla Oreo"},2,"10:30",13,1,"vs.",3,"Hayward","vs.","Dream Team",12,"11:30"]
[3,1,"vs.",3,"Bayfield","vs.","Vanilla Oreo",10,"11:30",14,2,"vs.",4,"We call game","vs.","BIG BUCKETS",13,"11:30"]
[4,4,"vs.",5,"We're just hockey players","vs.","MVP",11,"11:30",15,1,"vs.",4,"Hayward","vs.","BIG BUCKETS",3,"12:30"]
[5,3,"vs.",5,"Vanilla Oreo","vs.","MVP",1,"12:30",16,2,"vs.",3,"We call game","vs.","Dream Team",4,"12:30"]
[6,1,"vs.",2,"Bayfield","vs.","Size Matters",2,"12:30"]
[7,2,"vs.",5,"Size Matters","vs.","MVP",11,"1:30"]
[8,3,"vs.",4,"Vanilla Oreo","vs.","We're just hockey players",10,"1:30"]
[9,2,"vs.",4,"Size Matters","vs.","We're just hockey players",1,"2:30"]
[10,1,"vs.",5,"Bayfield","vs.","MVP",2,"2:30"]

{"sheet":"Form_Data","index":8,"n_rows":21,"n_cols":1,"rows_kept":21,"cut":false,"hidden":false,"merged":[]}
["Divisions"]
["11th 12th Boys"]
["11th 12th Boys Playoffs"]
["11th 12th Boys Championship"]
["Mens 30+ Pool A"]
["Mens 30+ Pool B"]
["Mens 30+ Championship"]
["Womens A"]
["Mens B Pool A"]
["Mens B Pool B"]
["Mens B Pool C"]
["Mens B Pool D"]
["Mens B Playoffs"]
["Mens B Championship"]
["Mens A Pool A"]
["Mens A Pool B"]
["Mens A Championship"]
["High School Girls"]
["9th 10th Boys Pool A"]
["9th 10th Boys Pool B"]
["9th 10th Boys Championship"]

{"sheet":"3 team","index":9,"n_rows":17,"n_cols":9,"rows_kept":17,"cut":false,"hidden":false,"merged":[[15,4,15,6],[12,4,12,6],[0,0,0,8],[1,0,1,8],[7,4,7,6],[2,6,2,8],[2,1,2,5],[3,1,3,5],[4,1,4,5],[5,1,5,5],[3,6,3,8],[4,6,4,8],[5,6,5,8]]}
["3 Team Bracket"]
[]
["Team","Name",null,null,null,null,"Contact"]
[1,"Pool A1"]
[2,"Pool A2"]
[3,"Pool A3"]
[]
["Game",null,null,null,"Teams",null,null,"Court","Time"]
[1,1,"vs.",2,{"$f":"CONCATENATE((IF($A$4=B9,$B$4,IF($A$5=B9,$B$5,IF($A$6=B9,$B$6,IF($A$7=B9,$B$7,\"?\"))))))","v":"Pool A1"},"vs.",{"$f":"CONCATENATE((IF($A$4=D9,$B$4,IF($A$5=D9,$B$5,IF($A$6=D9,$B$6,IF($A$7=D9,$B$7,\"?\"))))))","v":"Pool A2"}]
[2,2,"vs.",3,{"$f":"CONCATENATE((IF($A$4=B10,$B$4,IF($A$5=B10,$B$5,IF($A$6=B10,$B$6,IF($A$7=B10,$B$7,\"?\"))))))","v":"Pool A2"},"vs.",{"$f":"CONCATENATE((IF($A$4=D10,$B$4,IF($A$5=D10,$B$5,IF($A$6=D10,$B$6,IF($A$7=D10,$B$7,\"?\"))))))","v":"Pool A3"}]
[3,1,"vs.",3,{"$f":"CONCATENATE((IF($A$4=B11,$B$4,IF($A$5=B11,$B$5,IF($A$6=B11,$B$6,IF($A$7=B11,$B$7,\"?\"))))))","v":"Pool A1"},"vs.",{"$f":"CONCATENATE((IF($A$4=D11,$B$4,IF($A$5=D11,$B$5,IF($A$6=D11,$B$6,IF($A$7=D11,$B$7,\"?\"))))))","v":"Pool A3"}]
[]
["Game",null,null,null,"Semi-Final Game",null,null,"Court","Time"]
[4,null,null,null,"#2 Seed","vs.","#3 Seed"]
[]
["Game",null,null,null,"Championship Game",null,null,"Court","Time"]
[5,null,null,null,"#1 Seed","vs.","Winner of Game 4"]

{"sheet":"4 Teams","index":10,"n_rows":15,"n_cols":9,"rows_kept":15,"cut":false,"hidden":false,"merged":[[8,4,8,6],[4,1,4,5],[5,1,5,5],[6,1,6,5],[3,6,3,8],[4,6,4,8],[5,6,5,8],[6,6,6,8],[0,0,0,8],[1,0,1,8],[2,1,2,5],[2,6,2,8],[3,1,3,5]]}
["4 Team Bracket"]
[]
["Team","Name",null,null,null,null,"Contact"]
[1,"Pool A1"]
[2,"Pool A2"]
[3,"Pool A3"]
[4,"Pool A4"]
[]
["Game",null,null,null,"Teams",null,null,"Court","Time"]
[1,1,"vs.",2,{"$f":"CONCATENATE((IF($A$4=B10,$B$4,IF($A$5=B10,$B$5,IF($A$6=B10,$B$6,IF($A$7=B10,$B$7,\"?\"))))))","v":"Pool A1"},"vs.",{"$f":"CONCATENATE((IF($A$4=D10,$B$4,IF($A$5=D10,$B$5,IF($A$6=D10,$B$6,IF($A$7=D10,$B$7,\"?\"))))))","v":"Pool A2"}]
[2,3,"vs.",4,{"$f":"CONCATENATE((IF($A$4=B11,$B$4,IF($A$5=B11,$B$5,IF($A$6=B11,$B$6,IF($A$7=B11,$B$7,\"?\"))))))","v":"Pool A3"},"vs.","Pool A4"]
[3,1,"vs.",3,"Pool A1","vs.","Pool A3"]
[4,2,"vs.",4,"Pool A2","vs.","Pool A4"]
[5,1,"vs.",4,"Pool A1","vs.","Pool A4"]
[6,2,"vs.",3,"Pool A2","vs.","Pool A3"]

{"sheet":"5 team","index":11,"n_rows":20,"n_cols":9,"rows_kept":20,"cut":false,"hidden":false,"merged":[[9,4,9,6],[0,0,0,8],[1,0,1,8],[2,1,2,5],[2,6,2,8],[3,1,3,5],[4,1,4,5],[5,1,5,5],[6,1,6,5],[7,1,7,5],[3,6,3,8],[4,6,4,8],[5,6,5,8],[6,6,6,8],[7,6,7,8]]}
["5 Team Bracket"]
[]
["Team","Name",null,null,null,null,"Contact"]
[1,"Pool A1"]
[2,"Pool A2"]
[3,"Pool A3"]
[4,"Pool A4"]
[5,"Pool A5"]
[]
["Game",null,null,null,"Teams",null,null,"Court","Time"]
[1,1,"vs.",4,{"$f":"CONCATENATE((IF($A$4=B11,$B$4,IF($A$5=B11,$B$5,IF($A$6=B11,$B$6,IF($A$7=B11,$B$7,IF($A$8=B11,$B$8)))))))","v":"Pool A1"},"vs.",{"$f":"CONCATENATE((IF($A$4=D11,$B$4,IF($A$5=D11,$B$5,IF($A$6=D11,$B$6,IF($A$7=D11,$B$7,IF($A$8=D11,$B$8)))))))","v":"Pool A4"}]
[2,2,"vs.",3,{"$f":"CONCATENATE((IF($A$4=B12,$B$4,IF($A$5=B12,$B$5,IF($A$6=B12,$B$6,IF($A$7=B12,$B$7,IF($A$8=B12,$B$8)))))))","v":"Pool A2"},"vs.",{"$f":"CONCATENATE((IF($A$4=D12,$B$4,IF($A$5=D12,$B$5,IF($A$6=D12,$B$6,IF($A$7=D12,$B$7,IF($A$8=D12,$B$8)))))))","v":"Pool A3"}]
[3,1,"vs.",3,"Pool A1","vs.","Pool A3"]
[4,4,"vs.",5,"Pool A4","vs.","Pool A5"]
[5,3,"vs.",5,"Pool A3","vs.","Pool A5"]
[6,1,"vs.",2,"Pool A1","vs.","Pool A2"]
[7,2,"vs.",5,"Pool A2","vs.","Pool A5"]
[8,3,"vs.",4,"Pool A3","vs.","Pool A4"]
[9,2,"vs.",4,"Pool A2","vs.","Pool A4"]
[10,1,"vs.",5,"Pool A1","vs.","Pool A5"]

{"sheet":"6 Team Pool","index":12,"n_rows":12,"n_cols":24,"rows_kept":12,"cut":false,"hidden":false,"merged":[[0,18,0,23],[1,0,1,8],[1,9,1,17],[1,18,1,23],[4,1,4,5],[4,6,4,8],[4,10,4,14],[4,15,4,17],[0,0,0,8],[0,9,0,17],[2,19,2,21],[3,1,3,5],[3,6,3,8],[3,10,3,14],[3,15,3,17],[6,19,6,21],[8,4,8,6],[10,19,10,21],[5,1,5,5],[5,6,5,8],[5,10,5,14],[5,15,5,17],[6,1,6,5],[6,6,6,8],[6,10,6,14],[6,15,6,17]]}
["6 Team Bracket",null,null,null,null,null,null,null,null,{"$f":"A1","v":"6 Team Bracket"},null,null,null,null,null,null,null,null,{"$f":"J1","v":"6 Team Bracket"}]
["Pool A",null,null,null,null,null,null,null,null,"Pool B",null,null,null,null,null,null,null,null,"Playoffs"]
[null,null,null,null,null,null,null,null,null,null,null,null,null,null,null,null,null,null,"Game","Play-in Games",null,null,"Court","Time"]
["Team","Name",null,null,null,null,"Contact",null,null,"Team","Name",null,null,null,null,"Contact",null,null,7,"Pool A #2 Seed","vs.","Pool B #3 Seed"]
[1,"Pool A1",null,null,null,null,null,null,null,1,"Pool B1",null,null,null,null,null,null,null,8,"Pool B #2 Seed","vs.","Pool A #3 Seed"]
[2,"Pool A2",null,null,null,null,null,null,null,2,"Pool B2"]
[3,"Pool A3",null,null,null,null,null,null,null,3,"Pool B3",null,null,null,null,null,null,null,"Game","Semi-Final Games",null,null,"Court","Time"]
[null,null,null,null,null,null,null,null,null,null,null,null,null,null,null,null,null,null,9,"Winner Game 7","vs.","Pool A #1 Seed"]
["Game",null,null,null,"Teams",null,null,"Court","Time","Game",null,null,null,"Teams",null,null,"Court","Time",10,"Winner Game 8","vs.","Pool B #1 Seed"]
[1,1,"vs.",2,{"$f":"CONCATENATE((IF($A$5=B10,$B$5,IF($A$6=B10,$B$6,IF($A$7=B10,$B$7,IF($J$5=B10,$K$5,IF($J$6=B10,$K$6)))))))","v":"Pool A1"},"vs.",{"$f":"CONCATENATE((IF($A$5=D10,$B$5,IF($A$6=D10,$B$6,IF($A$7=D10,$B$7,IF($J$5=D10,$K$5,IF($J$6=D10,$K$6)))))))","v":"Pool A2"},null,null,4,1,"vs.",2,{"$f":"CONCATENATE((IF($J$5=K10,$K$5,IF($J$6=K10,$K$6,IF($J$7=K10,$K$7)))))","v":"Pool B1"},"vs.",{"$f":"CONCATENATE((IF($J$5=M10,$K$5,IF($J$6=M10,$K$6,IF($J$7=M10,$K$7)))))","v":"Pool B2"}]
[2,1,"vs.",3,{"$f":"CONCATENATE((IF($A$5=B11,$B$5,IF($A$6=B11,$B$6,IF($A$7=B11,$B$7,IF($J$5=B11,$K$5,IF($J$6=B11,$K$6)))))))","v":"Pool A1"},"vs.",{"$f":"CONCATENATE((IF($A$5=D11,$B$5,IF($A$6=D11,$B$6,IF($A$7=D11,$B$7,IF($J$5=D11,$K$5,IF($J$6=D11,$K$6)))))))","v":"Pool A3"},null,null,5,1,"vs.",3,{"$f":"CONCATENATE((IF($J$5=K11,$K$5,IF($J$6=K11,$K$6,IF($J$7=K11,$K$7)))))","v":"Pool B1"},"vs.",{"$f":"CONCATENATE((IF($J$5=M11,$K$5,IF($J$6=M11,$K$6,IF($J$7=M11,$K$7)))))","v":"Pool B3"},null,null,"Game","Championship Game",null,null,"Court","Time"]
[3,2,"vs.",3,{"$f":"CONCATENATE((IF($A$5=B12,$B$5,IF($A$6=B12,$B$6,IF($A$7=B12,$B$7,IF($J$5=B12,$K$5,IF($J$6=B12,$K$6)))))))","v":"Pool A2"},"vs.",{"$f":"CONCATENATE((IF($A$5=D12,$B$5,IF($A$6=D12,$B$6,IF($A$7=D12,$B$7,IF($J$5=D12,$K$5,IF($J$6=D12,$K$6)))))))","v":"Pool A3"},null,null,6,2,"vs.",3,{"$f":"CONCATENATE((IF($J$5=K12,$K$5,IF($J$6=K12,$K$6,IF($J$7=K12,$K$7)))))","v":"Pool B2"},"vs.",{"$f":"CONCATENATE((IF($J$5=M12,$K$5,IF($J$6=M12,$K$6,IF($J$7=M12,$K$7)))))","v":"Pool B3"},null,null,11,"Winner Game 9","vs.","Winner Game 10"]

{"sheet":"6 Team Round","index":13,"n_rows":26,"n_cols":9,"rows_kept":26,"cut":false,"hidden":false,"merged":[[0,0,0,8],[1,0,1,8],[2,1,2,5],[2,6,2,8],[3,1,3,5],[3,6,3,8],[4,1,4,5],[4,6,4,8],[5,1,5,5],[5,6,5,8],[6,1,6,5],[6,6,6,8],[7,1,7,5],[7,6,7,8],[10,4,10,6],[8,1,8,5],[8,6,8,8]]}
["6 Team Round Robin"]
[]
["Team","Name",null,null,null,null,"Contact"]
[1,"Pool A1"]
[2,"Pool A2"]
[3,"Pool A3"]
[4,"Pool A4"]
[5,"Pool A5"]
[6,"Pool A6"]
[]
["Game",null,null,null,"Teams",null,null,"Court","Time"]
[1,1,"vs.",6,{"$f":"CONCATENATE((IF($A$4=B12,$B$4,IF($A$5=B12,$B$5,IF($A$6=B12,$B$6,IF($A$7=B12,$B$7,IF($A$8=B12,$B$8,IF($A$9=B12,$B$9))))))))","v":"Pool A1"},"vs.",{"$f":"CONCATENATE((IF($A$4=D12,$B$4,IF($A$5=D12,$B$5,IF($A$6=D12,$B$6,IF($A$7=D12,$B$7,IF($A$8=D12,$B$8,IF($A$9=D12,$B$9))))))))","v":"Pool A6"}]
[2,2,"vs.",5,{"$f":"CONCATENATE((IF($A$4=B13,$B$4,IF($A$5=B13,$B$5,IF($A$6=B13,$B$6,IF($A$7=B13,$B$7,IF($A$8=B13,$B$8)))))))","v":"Pool A2"},"vs.",{"$f":"CONCATENATE((IF($A$4=D13,$B$4,IF($A$5=D13,$B$5,IF($A$6=D13,$B$6,IF($A$7=D13,$B$7,IF($A$8=D13,$B$8,IF($A$9=D13,$B$9))))))))","v":"Pool A5"}]
[3,3,"vs.",4,"Pool A3","vs.","Pool A4"]
[4,1,"vs.",5,"Pool A1","vs.","Pool A5"]
[5,2,"vs.",4,"Pool A2","vs.","Pool A4"]
[6,3,"vs.",6,"Pool A3","vs.","Pool A6"]
[7,1,"vs.",4,"Pool A1","vs.","Pool A4"]
[8,2,"vs.",3,"Pool A2","vs.","Pool A3"]
[9,5,"vs.",6,"Pool A5","vs.","Pool A6"]
[10,1,"vs.",3,"Pool A1","vs.","Pool A3"]
[11,2,"vs.",6,"Pool A2","vs.","Pool A6"]
[12,4,"vs.",5,"Pool A4","vs.","Pool A5"]
[13,1,"vs.",2,"Pool A1","vs.","Pool A2"]
[14,3,"vs.",5,"Pool A3","vs.","Pool A5"]
[15,4,"vs.",6,"Pool A4","vs.","Pool A6"]

{"sheet":"7 team","index":14,"n_rows":15,"n_cols":24,"rows_kept":15,"cut":false,"hidden":false,"merged":[[5,1,5,5],[5,6,5,8],[6,1,6,5],[6,6,6,8],[8,4,8,6],[3,10,3,14],[3,15,3,17],[0,0,0,8],[1,0,1,8],[2,1,2,5],[2,6,2,8],[3,1,3,5],[3,6,3,8],[4,1,4,5],[4,6,4,8],[7,19,7,21],[11,19,11,21],[0,18,0,23],[1,18,1,23],[3,19,3,21],[4,10,4,14],[4,15,4,17],[5,10,5,14],[5,15,5,17],[8,13,8,15],[0,9,0,17],[1,9,1,17],[2,10,2,14],[2,15,2,17]]}
["7 Team Bracket",null,null,null,null,null,null,null,null,{"$f":"A1","v":"7 Team Bracket"},null,null,null,null,null,null,null,null,{"$f":"J1","v":"7 Team Bracket"}]
["Pool A",null,null,null,null,null,null,null,null,"Pool B",null,null,null,null,null,null,null,null,"Playoffs"]
["Team","Name",null,null,null,null,"Contact",null,null,"Team","Name",null,null,null,null,"Contact"]
[1,"Pool A1",null,null,null,null,null,null,null,1,"Pool B1",null,null,null,null,null,null,null,"Game","Play-in Games",null,null,"Court","Time"]
[2,"Pool A2",null,null,null,null,null,null,null,2,"Pool B2",null,null,null,null,null,null,null,10,"Pool A #2 Seed","vs.","Pool B #3 Seed"]
[3,"Pool A3",null,null,null,null,null,null,null,3,"Pool B3",null,null,null,null,null,null,null,11,"Pool B #2 Seed","vs.","Pool A #3 Seed"]
[4,"Pool A4"]
[null,null,null,null,null,null,null,null,null,null,null,null,null,null,null,null,null,null,"Game","Semi-Final Games",null,null,"Court","Time"]
["Game",null,null,null,"Teams",null,null,"Court","Time","Game",null,null,null,"Teams",null,null,"Court","Time",12,"Winner Game 10","vs.","Pool A #1 Seed"]
[1,1,"vs.",2,{"$f":"CONCATENATE((IF($A$4=B10,$B$4,IF($A$5=B10,$B$5,IF($A$6=B10,$B$6,IF($A$7=B10,$B$7,\"?\"))))))","v":"Pool A1"},"vs.",{"$f":"CONCATENATE((IF($A$4=D10,$B$4,IF($A$5=D10,$B$5,IF($A$6=D10,$B$6,IF($A$7=D10,$B$7,\"?\"))))))","v":"Pool A2"},null,null,7,1,"vs.",2,{"$f":"CONCATENATE((IF($J$4=K10,$K$4,IF($J$5=K10,$K$5,IF($J$6=K10,$K$6,IF($J$7=K10,$K$7,\"?\"))))))","v":"Pool B1"},"vs.",{"$f":"CONCATENATE((IF($J$4=M10,$K$4,IF($J$5=M10,$K$5,IF($J$6=M10,$K$6,IF($J$7=M10,$K$7,\"?\"))))))","v":"Pool B2"},null,null,13,"Winner Game 11","vs.","Pool B #1 Seed"]
[2,3,"vs.",4,{"$f":"CONCATENATE((IF($A$4=B11,$B$4,IF($A$5=B11,$B$5,IF($A$6=B11,$B$6,IF($A$7=B11,$B$7,\"?\"))))))","v":"Pool A3"},"vs.","Pool A4",null,null,8,2,"vs.",3,{"$f":"CONCATENATE((IF($J$4=K11,$K$4,IF($J$5=K11,$K$5,IF($J$6=K11,$K$6,IF($J$7=K11,$K$7,\"?\"))))))","v":"Pool B2"},"vs.",{"$f":"CONCATENATE((IF($J$4=M11,$K$4,IF($J$5=M11,$K$5,IF($J$6=M11,$K$6,IF($J$7=M11,$K$7,\"?\"))))))","v":"Pool B3"}]
[3,1,"vs.",3,"Pool A1","vs.","Pool A3",null,null,9,1,"vs.",3,{"$f":"CONCATENATE((IF($J$4=K12,$K$4,IF($J$5=K12,$K$5,IF($J$6=K12,$K$6,IF($J$7=K12,$K$7,\"?\"))))))","v":"Pool B1"},"vs.",{"$f":"CONCATENATE((IF($J$4=M12,$K$4,IF($J$5=M12,$K$5,IF($J$6=M12,$K$6,IF($J$7=M12,$K$7,\"?\"))))))","v":"Pool B3"},null,null,"Game","Championship Game",null,null,"Court","Time"]
[4,2,"vs.",4,"Pool A2","vs.","Pool A4",null,null,null,null,null,null,null,null,null,null,null,14,"Winner Game 12","vs.","Winner Game 13"]
[5,1,"vs.",4,"Pool A1","vs.","Pool A4"]
[6,2,"vs.",3,"Pool A2","vs.","Pool A3"]

{"sheet":"8 Teams","index":15,"n_rows":15,"n_cols":24,"rows_kept":15,"cut":false,"hidden":false,"merged":[[0,0,0,8],[1,0,1,8],[2,1,2,5],[2,6,2,8],[3,1,3,5],[3,6,3,8],[8,13,8,15],[4,6,4,8],[5,1,5,5],[5,6,5,8],[6,1,6,5],[6,6,6,8],[4,1,4,5],[0,18,0,23],[1,18,1,23],[3,19,3,21],[8,4,8,6],[0,9,0,17],[1,9,1,17],[2,10,2,14],[2,15,2,17],[3,10,3,14],[3,15,3,17],[4,10,4,14],[4,15,4,17],[5,10,5,14],[5,15,5,17],[6,10,6,14],[6,15,6,17]]}
["8 Team Bracket",null,null,null,null,null,null,null,null,{"$f":"A1","v":"8 Team Bracket"},null,null,null,null,null,null,null,null,{"$f":"A1","v":"8 Team Bracket"}]
["Pool A",null,null,null,null,null,null,null,null,"Pool B",null,null,null,null,null,null,null,null,"Playoffs"]
["Team","Name",null,null,null,null,"Contact",null,null,"Team","Name",null,null,null,null,"Contact"]
[1,"Pool A1",null,null,null,null,null,null,null,1,"Pool B1",null,null,null,null,null,null,null,"Game","Championship Game",null,null,"Court","Time"]
[2,"Pool A2",null,null,null,null,null,null,null,2,"Pool B2",null,null,null,null,null,null,null,13,"Pool A #1 Seed","vs.","Pool B #1 Seed"]
[3,"Pool A3",null,null,null,null,null,null,null,3,"Pool B3"]
[4,"Pool A4",null,null,null,null,null,null,null,4,"Pool B4"]
[]
["Game",null,null,null,"Teams",null,null,"Court","Time","Game",null,null,null,"Teams",null,null,"Court","Time"]
[1,1,"vs.",2,{"$f":"CONCATENATE((IF($A$4=B10,$B$4,IF($A$5=B10,$B$5,IF($A$6=B10,$B$6,IF($A$7=B10,$B$7,\"?\"))))))","v":"Pool A1"},"vs.",{"$f":"CONCATENATE((IF($A$4=D10,$B$4,IF($A$5=D10,$B$5,IF($A$6=D10,$B$6,IF($A$7=D10,$B$7,\"?\"))))))","v":"Pool A2"},null,null,7,1,"vs.",2,{"$f":"CONCATENATE((IF($J$4=K10,$K$4,IF($J$5=K10,$K$5,IF($J$6=K10,$K$6,IF($J$7=K10,$K$7,\"?\"))))))","v":"Pool B1"},"vs.",{"$f":"CONCATENATE((IF($J$4=M10,$K$4,IF($J$5=M10,$K$5,IF($J$6=M10,$K$6,IF($J$7=M10,$K$7,\"?\"))))))","v":"Pool B2"}]
[2,3,"vs.",4,{"$f":"CONCATENATE((IF($A$4=B11,$B$4,IF($A$5=B11,$B$5,IF($A$6=B11,$B$6,IF($A$7=B11,$B$7,\"?\"))))))","v":"Pool A3"},"vs.","Pool A4",null,null,8,3,"vs.",4,{"$f":"CONCATENATE((IF($J$4=K11,$K$4,IF($J$5=K11,$K$5,IF($J$6=K11,$K$6,IF($J$7=K11,$K$7,\"?\"))))))","v":"Pool B3"},"vs.","Pool B4"]
[3,1,"vs.",3,"Pool A1","vs.","Pool A3",null,null,9,1,"vs.",3,"Pool B1","vs.","Pool B3"]
[4,2,"vs.",4,"Pool A2","vs.","Pool A4",null,null,10,2,"vs.",4,"Pool B2","vs.","Pool B4"]
[5,1,"vs.",4,"Pool A1","vs.","Pool A4",null,null,11,1,"vs.",4,"Pool B1","vs.","Pool B4"]
[6,2,"vs.",3,"Pool A2","vs.","Pool A3",null,null,12,2,"vs.",3,"Pool B2","vs.","Pool B3"]

{"sheet":"9 team","index":16,"n_rows":20,"n_cols":24,"rows_kept":20,"cut":false,"hidden":false,"merged":[[8,13,8,15],[0,0,0,8],[1,0,1,8],[2,1,2,5],[2,6,2,8],[3,1,3,5],[3,6,3,8],[4,1,4,5],[4,6,4,8],[5,1,5,5],[5,6,5,8],[6,1,6,5],[6,6,6,8],[7,1,7,5],[7,6,7,8],[0,18,0,23],[1,18,1,23],[3,19,3,21],[9,4,9,6],[0,9,0,17],[1,9,1,17],[2,10,2,14],[2,15,2,17],[3,10,3,14],[3,15,3,17],[4,10,4,14],[4,15,4,17],[5,10,5,14],[5,15,5,17],[6,10,6,14],[6,15,6,17]]}
["9 Team Bracket",null,null,null,null,null,null,null,null,{"$f":"A1","v":"9 Team Bracket"},null,null,null,null,null,null,null,null,{"$f":"A1","v":"9 Team Bracket"}]
["Pool A",null,null,null,null,null,null,null,null,"Pool B",null,null,null,null,null,null,null,null,"Playoffs"]
["Team","Name",null,null,null,null,"Contact",null,null,"Team","Name",null,null,null,null,"Contact"]
[1,"Pool A1",null,null,null,null,null,null,null,1,"Pool B1",null,null,null,null,null,null,null,"Game","Championship Game",null,null,"Court","Time"]
[2,"Pool A2",null,null,null,null,null,null,null,2,"Pool B2",null,null,null,null,null,null,null,17,"Pool A #1 Seed","vs.","Pool B #1 Seed"]
[3,"Pool A3",null,null,null,null,null,null,null,3,"Pool B3"]
[4,"Pool A4",null,null,null,null,null,null,null,4,"Pool B4"]
[5,"Pool A5"]
[null,null,null,null,null,null,null,null,null,"Game",null,null,null,"Teams",null,null,"Court","Time"]
["Game",null,null,null,"Teams",null,null,"Court","Time",11,1,"vs.",2,{"$f":"CONCATENATE((IF($J$4=K10,$K$4,IF($J$5=K10,$K$5,IF($J$6=K10,$K$6,IF($J$7=K10,$K$7,\"?\"))))))","v":"Pool B1"},"vs.",{"$f":"CONCATENATE((IF($J$4=M10,$K$4,IF($J$5=M10,$K$5,IF($J$6=M10,$K$6,IF($J$7=M10,$K$7,\"?\"))))))","v":"Pool B2"}]
[1,1,"vs.",4,{"$f":"CONCATENATE((IF($A$4=B11,$B$4,IF($A$5=B11,$B$5,IF($A$6=B11,$B$6,IF($A$7=B11,$B$7,IF($A$8=B11,$B$8)))))))","v":"Pool A1"},"vs.",{"$f":"CONCATENATE((IF($A$4=D11,$B$4,IF($A$5=D11,$B$5,IF($A$6=D11,$B$6,IF($A$7=D11,$B$7,IF($A$8=D11,$B$8)))))))","v":"Pool A4"},null,null,12,3,"vs.",4,{"$f":"CONCATENATE((IF($J$4=K11,$K$4,IF($J$5=K11,$K$5,IF($J$6=K11,$K$6,IF($J$7=K11,$K$7,\"?\"))))))","v":"Pool B3"},"vs.",{"$f":"CONCATENATE((IF($J$4=M11,$K$4,IF($J$5=M11,$K$5,IF($J$6=M11,$K$6,IF($J$7=M11,$K$7,\"?\"))))))","v":"Pool B4"}]
[2,2,"vs.",3,{"$f":"CONCATENATE((IF($A$4=B12,$B$4,IF($A$5=B12,$B$5,IF($A$6=B12,$B$6,IF($A$7=B12,$B$7,IF($A$8=B12,$B$8)))))))","v":"Pool A2"},"vs.",{"$f":"CONCATENATE((IF($A$4=D12,$B$4,IF($A$5=D12,$B$5,IF($A$6=D12,$B$6,IF($A$7=D12,$B$7,IF($A$8=D12,$B$8)))))))","v":"Pool A3"},null,null,13,1,"vs.",3,"Pool B1","vs.","Pool B3"]
[3,1,"vs.",3,"Pool A1","vs.","Pool A3",null,null,14,2,"vs.",4,"Pool B2","vs.","Pool B4"]
[4,4,"vs.",5,"Pool A4","vs.","Pool A5",null,null,15,1,"vs.",4,"Pool B1","vs.","Pool B4"]
[5,3,"vs.",5,"Pool A3","vs.","Pool A5",null,null,16,2,"vs.",3,"Pool B2","vs.","Pool B3"]
[6,1,"vs.",2,"Pool A1","vs.","Pool A2"]
[7,2,"vs.",5,"Pool A2","vs.","Pool A5"]
[8,3,"vs.",4,"Pool A3","vs.","Pool A4"]
[9,2,"vs.",4,"Pool A2","vs.","Pool A4"]
[10,1,"vs.",5,"Pool A1","vs.","Pool A5"]

{"sheet":"10 team","index":17,"n_rows":20,"n_cols":24,"rows_kept":20,"cut":false,"hidden":false,"merged":[[0,0,0,8],[1,0,1,8],[2,1,2,5],[2,6,2,8],[3,1,3,5],[3,6,3,8],[5,1,5,5],[5,6,5,8],[6,1,6,5],[6,6,6,8],[4,1,4,5],[7,1,7,5],[7,6,7,8],[9,4,9,6],[0,9,0,17],[1,9,1,17],[2,10,2,14],[2,15,2,17],[3,10,3,14],[3,15,3,17],[4,10,4,14],[4,15,4,17],[5,10,5,14],[5,15,5,17],[6,10,6,14],[6,15,6,17],[4,6,4,8],[7,10,7,14],[7,15,7,17],[9,13,9,15],[0,18,0,23],[1,18,1,23],[3,19,3,21]]}
["10 Team Bracket",null,null,null,null,null,null,null,null,{"$f":"A1","v":"10 Team Bracket"},null,null,null,null,null,null,null,null,{"$f":"A1","v":"10 Team Bracket"}]
["Pool A",null,null,null,null,null,null,null,null,"Pool B",null,null,null,null,null,null,null,null,"Playoffs"]
["Team","Name",null,null,null,null,"Contact",null,null,"Team","Name",null,null,null,null,"Contact"]
[1,"Pool A1",null,null,null,null,null,null,null,1,"Pool B1",null,null,null,null,null,null,null,"Game","Championship Game",null,null,"Court","Time"]
[2,"Pool A2",null,null,null,null,null,null,null,2,"Pool B2",null,null,null,null,null,null,null,21,"Pool A #1 Seed","vs.","Pool B #1 Seed"]
[3,"Pool A3",null,null,null,null,null,null,null,3,"Pool B3"]
[4,"Pool A4",null,null,null,null,null,null,null,4,"Pool B4"]
[5,"Pool A5",null,null,null,null,null,null,null,5,"Pool B5"]
[]
["Game",null,null,null,"Teams",null,null,"Court","Time","Game",null,null,null,"Teams",null,null,"Court","Time"]
[1,1,"vs.",4,{"$f":"CONCATENATE((IF($A$4=B11,$B$4,IF($A$5=B11,$B$5,IF($A$6=B11,$B$6,IF($A$7=B11,$B$7,IF($A$8=B11,$B$8)))))))","v":"Pool A1"},"vs.",{"$f":"CONCATENATE((IF($A$4=D11,$B$4,IF($A$5=D11,$B$5,IF($A$6=D11,$B$6,IF($A$7=D11,$B$7,IF($A$8=D11,$B$8)))))))","v":"Pool A4"},null,null,11,1,"vs.",4,{"$f":"CONCATENATE((IF($J$4=K11,$K$4,IF($J$5=K11,$K$5,IF($J$6=K11,$K$6,IF($J$7=K11,$K$7,IF($J$8=K11,$K$8)))))))","v":"Pool B1"},"vs.",{"$f":"CONCATENATE((IF($J$4=M11,$K$4,IF($J$5=M11,$K$5,IF($J$6=M11,$K$6,IF($J$7=M11,$K$7,IF($J$8=M11,$K$8)))))))","v":"Pool B4"}]
[2,2,"vs.",3,{"$f":"CONCATENATE((IF($A$4=B12,$B$4,IF($A$5=B12,$B$5,IF($A$6=B12,$B$6,IF($A$7=B12,$B$7,IF($A$8=B12,$B$8)))))))","v":"Pool A2"},"vs.",{"$f":"CONCATENATE((IF($A$4=D12,$B$4,IF($A$5=D12,$B$5,IF($A$6=D12,$B$6,IF($A$7=D12,$B$7,IF($A$8=D12,$B$8)))))))","v":"Pool A3"},null,null,12,2,"vs.",3,{"$f":"CONCATENATE((IF($J$4=K12,$K$4,IF($J$5=K12,$K$5,IF($J$6=K12,$K$6,IF($J$7=K12,$K$7,IF($J$8=K12,$K$8)))))))","v":"Pool B2"},"vs.",{"$f":"CONCATENATE((IF($J$4=M12,$K$4,IF($J$5=M12,$K$5,IF($J$6=M12,$K$6,IF($J$7=M12,$K$7,IF($J$8=M12,$K$8)))))))","v":"Pool B3"}]
[3,1,"vs.",3,"Pool A1","vs.","Pool A3",null,null,13,1,"vs.",3,"Pool B1","vs.","Pool B3"]
[4,4,"vs.",5,"Pool A4","vs.","Pool A5",null,null,14,4,"vs.",5,"Pool B4","vs.","Pool B5"]
[5,3,"vs.",5,"Pool A3","vs.","Pool A5",null,null,15,3,"vs.",5,"Pool B3","vs.","Pool B5"]
[6,1,"vs.",2,"Pool A1","vs.","Pool A2",null,null,16,1,"vs.",2,"Pool B1","vs.","Pool B2"]
[7,2,"vs.",5,"Pool A2","vs.","Pool A5",null,null,17,2,"vs.",5,"Pool B2","vs.","Pool B5"]
[8,3,"vs.",4,"Pool A3","vs.","Pool A4",null,null,18,3,"vs.",4,"Pool B3","vs.","Pool B4"]
[9,2,"vs.",4,"Pool A2","vs.","Pool A4",null,null,19,2,"vs.",4,"Pool B2","vs.","Pool B4"]
[10,1,"vs.",5,"Pool A1","vs.","Pool A5",null,null,20,1,"vs.",5,"Pool B1","vs.","Pool B5"]

{"sheet":"11 teams","index":18,"n_rows":23,"n_cols":24,"rows_kept":23,"cut":false,"hidden":false,"merged":[[0,0,0,8],[1,0,1,8],[2,1,2,5],[2,6,2,8],[3,1,3,5],[3,6,3,8],[9,13,9,15],[10,4,10,6],[4,1,4,5],[4,6,4,8],[5,1,5,5],[5,6,5,8],[6,1,6,5],[6,6,6,8],[7,10,7,14],[7,15,7,17],[7,1,7,5],[7,6,7,8],[8,1,8,5],[8,6,8,8],[4,10,4,14],[4,15,4,17],[5,10,5,14],[5,15,5,17],[6,10,6,14],[6,15,6,17],[0,18,0,23],[1,18,1,23],[3,19,3,21],[0,9,0,17],[1,9,1,17],[2,10,2,14],[2,15,2,17],[3,10,3,14],[3,15,3,17]]}
["11 Team Bracket",null,null,null,null,null,null,null,null,{"$f":"A1","v":"11 Team Bracket"},null,null,null,null,null,null,null,null,{"$f":"A1","v":"11 Team Bracket"}]
["Pool A",null,null,null,null,null,null,null,null,"Pool B",null,null,null,null,null,null,null,null,"Playoffs"]
["Team","Name",null,null,null,null,"Contact",null,null,"Team","Name",null,null,null,null,"Contact"]
[1,"Pool A1",null,null,null,null,null,null,null,1,"Pool B1",null,null,null,null,null,null,null,"Game","Championship Game",null,null,"Court","Time"]
[2,"Pool A2",null,null,null,null,null,null,null,2,"Pool B2",null,null,null,null,null,null,null,23,"Pool A #1 Seed","vs.","Pool B #1 Seed"]
[3,"Pool A3",null,null,null,null,null,null,null,3,"Pool B3"]
[4,"Pool A4",null,null,null,null,null,null,null,4,"Pool B4"]
[5,"Pool A5",null,null,null,null,null,null,null,5,"Pool B5"]
[6,"Pool A6"]
[null,null,null,null,null,null,null,null,null,"Game",null,null,null,"Teams",null,null,"Court","Time"]
["Game",null,null,null,"Teams",null,null,"Court","Time",13,1,"vs.",4,{"$f":"CONCATENATE((IF($J$4=K11,$K$4,IF($J$5=K11,$K$5,IF($J$6=K11,$K$6,IF($J$7=K11,$K$7,IF($J$8=K11,$K$8)))))))","v":"Pool B1"},"vs.",{"$f":"CONCATENATE((IF($J$4=M11,$K$4,IF($J$5=M11,$K$5,IF($J$6=M11,$K$6,IF($J$7=M11,$K$7,IF($J$8=M11,$K$8)))))))","v":"Pool B4"}]
[1,1,"vs.",2,{"$f":"CONCATENATE((IF($A$4=B12,$B$4,IF($A$5=B12,$B$5,IF($A$6=B12,$B$6,IF($A$7=B12,$B$7,IF($A$8=B12,$B$8,IF($A$9=B12,$B$9))))))))","v":"Pool A1"},"vs.",{"$f":"CONCATENATE((IF($A$4=D12,$B$4,IF($A$5=D12,$B$5,IF($A$6=D12,$B$6,IF($A$7=D12,$B$7,IF($A$8=D12,$B$8,IF($A$9=D12,$B$9))))))))","v":"Pool A2"},null,null,14,2,"vs.",3,{"$f":"CONCATENATE((IF($J$4=K12,$K$4,IF($J$5=K12,$K$5,IF($J$6=K12,$K$6,IF($J$7=K12,$K$7,IF($J$8=K12,$K$8)))))))","v":"Pool B2"},"vs.",{"$f":"CONCATENATE((IF($J$4=M12,$K$4,IF($J$5=M12,$K$5,IF($J$6=M12,$K$6,IF($J$7=M12,$K$7,IF($J$8=M12,$K$8)))))))","v":"Pool B3"}]
[2,3,"vs.",6,{"$f":"CONCATENATE((IF($A$4=B13,$B$4,IF($A$5=B13,$B$5,IF($A$6=B13,$B$6,IF($A$7=B13,$B$7,IF($A$8=B13,$B$8)))))))","v":"Pool A3"},"vs.",{"$f":"CONCATENATE((IF($A$4=D13,$B$4,IF($A$5=D13,$B$5,IF($A$6=D13,$B$6,IF($A$7=D13,$B$7,IF($A$8=D13,$B$8,IF($A$9=D13,$B$9))))))))","v":"Pool A6"},null,null,15,1,"vs.",3,"Pool B1","vs.","Pool B3"]
[3,4,"vs.",5,"Pool A4","vs.","Pool A5",null,null,16,4,"vs.",5,"Pool B4","vs.","Pool B5"]
[4,3,"vs.",4,"Pool A3","vs.","Pool A4",null,null,17,3,"vs.",5,"Pool B3","vs.","Pool B5"]
[5,1,"vs.",6,"Pool A1","vs.","Pool A6",null,null,18,1,"vs.",2,"Pool B1","vs.","Pool B2"]
[6,2,"vs.",5,"Pool A2","vs.","Pool A5",null,null,19,2,"vs.",5,"Pool B2","vs.","Pool B5"]
[7,4,"vs.",6,"Pool A4","vs.","Pool A6",null,null,20,3,"vs.",4,"Pool B3","vs.","Pool B4"]
[8,2,"vs.",3,"Pool A2","vs.","Pool A3",null,null,21,2,"vs.",4,"Pool B2","vs.","Pool B4"]
[9,1,"vs.",5,"Pool A1","vs.","Pool A5",null,null,22,1,"vs.",5,"Pool B1","vs.","Pool B5"]
[10,1,"vs.",4,"Pool A1","vs.","Pool A4"]
[11,3,"vs.",5,"Pool A3","vs.","Pool A5"]
[12,2,"vs.",6,"Pool A2","vs.","Pool A6"]

{"sheet":"12 team","index":19,"n_rows":15,"n_cols":33,"rows_kept":15,"cut":false,"hidden":false,"merged":[[0,27,0,32],[1,27,1,32],[3,28,3,30],[6,28,6,30],[2,1,2,5],[0,0,0,8],[1,0,1,8],[3,1,3,5],[4,1,4,5],[2,6,2,8],[3,6,3,8],[4,6,4,8],[5,6,5,8],[6,6,6,8],[0,9,0,17],[1,9,1,17],[2,10,2,14],[2,15,2,17],[3,10,3,14],[3,15,3,17],[0,18,0,26],[1,18,1,26],[2,19,2,23],[2,24,2,26],[3,19,3,23],[3,24,3,26],[4,19,4,23],[4,24,4,26],[5,19,5,23],[5,24,5,26],[6,19,6,23],[6,24,6,26],[4,10,4,14],[4,15,4,17],[5,10,5,14],[5,15,5,17],[6,10,6,14],[6,15,6,17],[8,4,8,6],[8,13,8,15],[8,22,8,24],[6,1,6,5],[5,1,5,5]]}
["12 Team Bracket",null,null,null,null,null,null,null,null,{"$f":"A1","v":"12 Team Bracket"},null,null,null,null,null,null,null,null,{"$f":"J1","v":"12 Team Bracket"},null,null,null,null,null,null,null,null,{"$f":"A1","v":"12 Team Bracket"}]
["Pool A",null,null,null,null,null,null,null,null,"Pool B",null,null,null,null,null,null,null,null,"Pool C",null,null,null,null,null,null,null,null,"Playoffs"]
["Team","Name",null,null,null,null,"Contact",null,null,"Team","Name",null,null,null,null,"Contact",null,null,"Team","Name",null,null,null,null,"Contact"]
[1,"Pool A1",null,null,null,null,null,null,null,1,"Pool B1",null,null,null,null,null,null,null,1,"Pool C1",null,null,null,null,null,null,null,"Game","Semi-Final Game",null,null,"Court","Time"]
[2,"Pool A2",null,null,null,null,null,null,null,2,"Pool B2",null,null,null,null,null,null,null,2,"Pool C2",null,null,null,null,null,null,null,19,"#2 Seeded Pool Winner","vs.","#3 Seeded Pool Winner"]
[3,"Pool A3",null,null,null,null,null,null,null,3,"Pool B3",null,null,null,null,null,null,null,3,"Pool C3"]
[4,"Pool A4",null,null,null,null,null,null,null,4,"Pool B4",null,null,null,null,null,null,null,4,"Pool C4",null,null,null,null,null,null,null,"Game","Championship Game",null,null,"Court","Time"]
[null,null,null,null,null,null,null,null,null,null,null,null,null,null,null,null,null,null,null,null,null,null,null,null,null,null,null,20,"#1 Seeded Pool Winner","vs.","Winner of Game 19"]
["Game",null,null,null,"Teams",null,null,"Court","Time","Game",null,null,null,"Teams",null,null,"Court","Time","Game",null,null,null,"Teams",null,null,"Court","Time"]
[1,1,"vs.",2,{"$f":"CONCATENATE((IF($A$4=B10,$B$4,IF($A$5=B10,$B$5,IF($A$6=B10,$B$6,IF($A$7=B10,$B$7))))))","v":"Pool A1"},"vs.",{"$f":"CONCATENATE(IF($A$4=D10,$B$4,IF($A$5=D10,$B$5,IF($A$6=D10,$B$6,IF($A$7=D10,$B$7)))))","v":"Pool A2"},null,null,7,1,"vs.",2,{"$f":"CONCATENATE((IF($J$4=K10,$K$4,IF($J$5=K10,$K$5,IF($J$6=K10,$K$6,IF($J$7=K10,$K$7))))))","v":"Pool B1"},"vs.",{"$f":"CONCATENATE((IF($J$4=M10,$K$4,IF($J$5=M10,$K$5,IF($J$6=M10,$K$6,IF($J$7=M10,$K$7))))))","v":"Pool B2"},null,null,13,1,"vs.",2,{"$f":"CONCATENATE((IF($S$4=T10,$T$4,IF($S$5=T10,$T$5,IF($S$6=T10,$T$6,IF($S$7=T10,$T$7))))))","v":"Pool C1"},"vs.",{"$f":"CONCATENATE((IF($S$4=V10,$T$4,IF($S$5=V10,$T$5,IF($S$6=V10,$T$6,IF($S$7=V10,$T$7))))))","v":"Pool C2"}]
[2,3,"vs.",4,{"$f":"CONCATENATE((IF($A$4=B11,$B$4,IF($A$5=B11,$B$5,IF($A$6=B11,$B$6,IF($A$7=B11,$B$7))))))","v":"Pool A3"},"vs.",{"$f":"CONCATENATE(IF($A$4=D11,$B$4,IF($A$5=D11,$B$5,IF($A$6=D11,$B$6,IF($A$7=D11,$B$7)))))","v":"Pool A4"},null,null,8,3,"vs.",4,{"$f":"CONCATENATE((IF($J$4=K11,$K$4,IF($J$5=K11,$K$5,IF($J$6=K11,$K$6,IF($J$7=K11,$K$7))))))","v":"Pool B3"},"vs.",{"$f":"CONCATENATE((IF($J$4=M11,$K$4,IF($J$5=M11,$K$5,IF($J$6=M11,$K$6,IF($J$7=M11,$K$7))))))","v":"Pool B4"},null,null,14,3,"vs.",4,{"$f":"CONCATENATE((IF($S$4=T11,$T$4,IF($S$5=T11,$T$5,IF($S$6=T11,$T$6,IF($S$7=T11,$T$7))))))","v":"Pool C3"},"vs.",{"$f":"CONCATENATE((IF($S$4=V11,$T$4,IF($S$5=V11,$T$5,IF($S$6=V11,$T$6,IF($S$7=V11,$T$7))))))","v":"Pool C4"}]
[3,1,"vs.",3,"Pool A1","vs.","Pool A3",null,null,9,1,"vs.",3,"Pool B1","vs.","Pool B3",null,null,15,1,"vs.",3,"Pool C1","vs.","Pool C3"]
[4,2,"vs.",4,"Pool A2","vs.","Pool A4",null,null,10,2,"vs.",4,"Pool B2","vs.","Pool B4",null,null,16,2,"vs.",4,"Pool C2","vs.","Pool C4"]
[5,1,"vs.",4,"Pool A1","vs.","Pool A4",null,null,11,1,"vs.",4,"Pool B1","vs.","Pool B4",null,null,17,1,"vs.",4,"Pool C1","vs.","Pool C4"]
[6,2,"vs.",3,"Pool A2","vs.","Pool A3",null,null,12,2,"vs.",3,"Pool B2","vs.","Pool B3",null,null,18,2,"vs.",3,"Pool C2","vs.","Pool C3"]

{"sheet":"13 team","index":20,"n_rows":20,"n_cols":33,"rows_kept":20,"cut":false,"hidden":false,"merged":[[1,0,1,8],[2,1,2,5],[2,6,2,8],[3,1,3,5],[3,6,3,8],[7,1,7,5],[7,6,7,8],[9,4,9,6],[0,9,0,17],[1,9,1,17],[2,10,2,14],[2,15,2,17],[3,10,3,14],[3,15,3,17],[4,1,4,5],[4,6,4,8],[5,1,5,5],[5,6,5,8],[6,1,6,5],[6,6,6,8],[0,0,0,8],[3,24,3,26],[9,13,9,15],[4,10,4,14],[4,15,4,17],[5,10,5,14],[5,15,5,17],[6,10,6,14],[6,15,6,17],[0,27,0,32],[1,27,1,32],[6,28,6,30],[9,22,9,24],[3,28,3,30],[4,19,4,23],[4,24,4,26],[5,19,5,23],[5,24,5,26],[6,19,6,23],[6,24,6,26],[0,18,0,26],[1,18,1,26],[2,19,2,23],[2,24,2,26],[3,19,3,23]]}
["13 Team Bracket",null,null,null,null,null,null,null,null,{"$f":"A1","v":"13 Team Bracket"},null,null,null,null,null,null,null,null,{"$f":"J1","v":"13 Team Bracket"},null,null,null,null,null,null,null,null,{"$f":"S1","v":"13 Team Bracket"}]
["Pool A",null,null,null,null,null,null,null,null,"Pool B",null,null,null,null,null,null,null,null,"Pool C",null,null,null,null,null,null,null,null,"Playoffs"]
["Team","Name",null,null,null,null,"Contact",null,null,"Team","Name",null,null,null,null,"Contact",null,null,"Team","Name",null,null,null,null,"Contact"]
[1,"Pool A1",null,null,null,null,null,null,null,1,"Pool B1",null,null,null,null,null,null,null,1,"Pool C1",null,null,null,null,null,null,null,"Game","Semi-Final Game",null,null,"Court","Time"]
[2,"Pool A2",null,null,null,null,null,null,null,2,"Pool B2",null,null,null,null,null,null,null,2,"Pool C2",null,null,null,null,null,null,null,23,"#2 Seeded Pool Winner","vs.","#3 Seeded Pool Winner"]
[3,"Pool A3",null,null,null,null,null,null,null,3,"Pool B3",null,null,null,null,null,null,null,3,"Pool C3"]
[4,"Pool A4",null,null,null,null,null,null,null,4,"Pool B4",null,null,null,null,null,null,null,4,"Pool C4",null,null,null,null,null,null,null,"Game","Championship Game",null,null,"Court","Time"]
[5,"Pool A5",null,null,null,null,null,null,null,null,null,null,null,null,null,null,null,null,null,null,null,null,null,null,null,null,null,24,"#1 Seeded Pool Winner","vs.","Winner of Game 23"]
[]
["Game",null,null,null,"Teams",null,null,"Court","Time","Game",null,null,null,"Teams",null,null,"Court","Time","Game",null,null,null,"Teams",null,null,"Court","Time"]
[1,1,"vs.",4,{"$f":"CONCATENATE((IF($A$4=B11,$B$4,IF($A$5=B11,$B$5,IF($A$6=B11,$B$6,IF($A$7=B11,$B$7,IF($A$8=B11,$B$8)))))))","v":"Pool A1"},"vs.",{"$f":"CONCATENATE((IF($A$4=D11,$B$4,IF($A$5=D11,$B$5,IF($A$6=D11,$B$6,IF($A$7=D11,$B$7,IF($A$8=D11,$B$8)))))))","v":"Pool A4"},null,null,11,1,"vs.",2,{"$f":"CONCATENATE((IF($J$4=K11,$K$4,IF($J$5=K11,$K$5,IF($J$6=K11,$K$6,IF($J$7=K11,$K$7,\"?\"))))))","v":"Pool B1"},"vs.",{"$f":"CONCATENATE((IF($J$4=M11,$K$4,IF($J$5=M11,$K$5,IF($J$6=M11,$K$6,IF($J$7=M11,$K$7,\"?\"))))))","v":"Pool B2"},null,null,17,1,"vs.",2,{"$f":"CONCATENATE((IF($S$4=T11,$T$4,IF($S$5=T11,$T$5,IF($S$6=T11,$T$6,IF($S$7=T11,$T$7,\"?\"))))))","v":"Pool C1"},"vs.",{"$f":"CONCATENATE((IF($S$4=V11,$T$4,IF($S$5=V11,$T$5,IF($S$6=V11,$T$6,IF($S$7=V11,$T$7,\"?\"))))))","v":"Pool C2"}]
[2,2,"vs.",3,{"$f":"CONCATENATE((IF($A$4=B12,$B$4,IF($A$5=B12,$B$5,IF($A$6=B12,$B$6,IF($A$7=B12,$B$7,IF($A$8=B12,$B$8)))))))","v":"Pool A2"},"vs.",{"$f":"CONCATENATE((IF($A$4=D12,$B$4,IF($A$5=D12,$B$5,IF($A$6=D12,$B$6,IF($A$7=D12,$B$7,IF($A$8=D12,$B$8)))))))","v":"Pool A3"},null,null,12,3,"vs.",4,{"$f":"CONCATENATE((IF($J$4=K12,$K$4,IF($J$5=K12,$K$5,IF($J$6=K12,$K$6,IF($J$7=K12,$K$7,\"?\"))))))","v":"Pool B3"},"vs.",{"$f":"CONCATENATE((IF($J$4=M12,$K$4,IF($J$5=M12,$K$5,IF($J$6=M12,$K$6,IF($J$7=M12,$K$7,\"?\"))))))","v":"Pool B4"},null,null,18,3,"vs.",4,{"$f":"CONCATENATE((IF($S$4=T12,$T$4,IF($S$5=T12,$T$5,IF($S$6=T12,$T$6,IF($S$7=T12,$T$7,\"?\"))))))","v":"Pool C3"},"vs.",{"$f":"CONCATENATE((IF($S$4=V12,$T$4,IF($S$5=V12,$T$5,IF($S$6=V12,$T$6,IF($S$7=V12,$T$7,\"?\"))))))","v":"Pool C4"}]
[3,1,"vs.",3,"Pool A1","vs.","Pool A3",null,null,13,1,"vs.",3,"Pool B1","vs.","Pool B3",null,null,19,1,"vs.",3,"Pool C1","vs.","Pool C3"]
[4,4,"vs.",5,"Pool A4","vs.","Pool A5",null,null,14,2,"vs.",4,"Pool B2","vs.","Pool B4",null,null,20,2,"vs.",4,"Pool C2","vs.","Pool C4"]
[5,3,"vs.",5,"Pool A3","vs.","Pool A5",null,null,15,1,"vs.",4,"Pool B1","vs.","Pool B4",null,null,21,1,"vs.",4,"Pool C1","vs.","Pool C4"]
[6,1,"vs.",2,"Pool A1","vs.","Pool A2",null,null,16,2,"vs.",3,"Pool B2","vs.","Pool B3",null,null,22,2,"vs.",3,"Pool C2","vs.","Pool C3"]
[7,2,"vs.",5,"Pool A2","vs.","Pool A5"]
[8,3,"vs.",4,"Pool A3","vs.","Pool A4"]
[9,2,"vs.",4,"Pool A2","vs.","Pool A4"]
[10,1,"vs.",5,"Pool A1","vs.","Pool A5"]

{"sheet":"14 team","index":21,"n_rows":20,"n_cols":33,"rows_kept":20,"cut":false,"hidden":false,"merged":[[42,0,42,3],[81,0,81,3],[5,10,5,14],[6,10,6,14],[5,1,5,5],[6,1,6,5],[7,10,7,14],[9,4,9,6],[9,13,9,15],[7,1,7,5],[5,6,5,8],[6,6,6,8],[7,6,7,8],[0,0,0,8],[1,0,1,8],[0,9,0,17],[1,9,1,17],[4,1,4,5],[2,1,2,5],[3,1,3,5],[2,6,2,8],[3,6,3,8],[4,6,4,8],[1,18,1,26],[2,19,2,23],[3,19,3,23],[4,19,4,23],[2,10,2,14],[3,10,3,14],[4,10,4,14],[2,15,2,17],[2,24,2,26],[0,27,0,32],[1,27,1,32],[9,22,9,24],[3,15,3,17],[4,15,4,17],[5,15,5,17],[6,15,6,17],[7,15,7,17],[5,19,5,23],[6,19,6,23],[7,19,7,23],[3,24,3,26],[4,24,4,26],[5,24,5,26],[6,24,6,26],[0,18,0,26]]}
["14 Team Bracket",null,null,null,null,null,null,null,null,{"$f":"A1","v":"14 Team Bracket"},null,null,null,null,null,null,null,null,{"$f":"A1","v":"14 Team Bracket"},null,null,null,null,null,null,null,null,{"$f":"A1","v":"14 Team Bracket"}]
["Pool A",null,null,null,null,null,null,null,null,"Pool B",null,null,null,null,null,null,null,null,"Pool C",null,null,null,null,null,null,null,null,"Playoff"]
["Team","Name",null,null,null,null,"Contact",null,null,"Team","Name",null,null,null,null,"Contact",null,null,"Team","Name",null,null,null,null,"Contact",null,null,"Game",null,null,null,"Court","Time"]
[1,"Pool A1",null,null,null,null,null,null,null,1,"Pool B1",null,null,null,null,null,null,null,1,"Pool C1",null,null,null,null,null,null,null,27,"#2 Seed Pool Winner","vs.","#3 Seed Pool Winner"]
[2,"Pool A2",null,null,null,null,null,null,null,2,"Pool B2",null,null,null,null,null,null,null,2,"Pool C2"]
[3,"Pool A3",null,null,null,null,null,null,null,3,"Pool B3",null,null,null,null,null,null,null,3,"Pool C3",null,null,null,null,null,null,null,"Game",null,null,null,"Court","Time"]
[4,"Pool A4",null,null,null,null,null,null,null,4,"Pool B4",null,null,null,null,null,null,null,4,"Pool C4",null,null,null,null,null,null,null,28,"Winner Game 27","vs.","#1 Seed Pool Winner"]
[5,"Pool A5",null,null,null,null,null,null,null,5,"Pool B5"]
[]
["Game",null,null,null,"Teams",null,null,"Court","Time","Game",null,null,null,"Teams",null,null,"Court","Time","Game",null,null,null,"Teams",null,null,"Court","Time"]
[1,1,"vs.",4,{"$f":"CONCATENATE((IF($A$4=B11,$B$4,IF($A$5=B11,$B$5,IF($A$6=B11,$B$6,IF($A$7=B11,$B$7,IF($A$8=B11,$B$8)))))))","v":"Pool A1"},"vs.",{"$f":"CONCATENATE((IF($A$4=D11,$B$4,IF($A$5=D11,$B$5,IF($A$6=D11,$B$6,IF($A$7=D11,$B$7,IF($A$8=D11,$B$8)))))))","v":"Pool A4"},null,null,11,1,"vs.",4,{"$f":"CONCATENATE((IF($J$4=K11,$K$4,IF($J$5=K11,$K$5,IF($J$6=K11,$K$6,IF($J$7=K11,$K$7,IF($J$8=K11,$K$8)))))))","v":"Pool B1"},"vs.",{"$f":"CONCATENATE((IF($J$4=M11,$K$4,IF($J$5=M11,$K$5,IF($J$6=M11,$K$6,IF($J$7=M11,$K$7,IF($J$8=M11,$K$8)))))))","v":"Pool B4"},null,null,21,1,"vs.",2,{"$f":"CONCATENATE((IF($S$4=T11,$T$4,IF($S$5=T11,$T$5,IF($S$6=T11,$T$6,IF($S$7=T11,$T$7,IF($S$8=T11,$T$8)))))))","v":"Pool C1"},"vs.",{"$f":"CONCATENATE((IF($S$4=V11,$T$4,IF($S$5=V11,$T$5,IF($S$6=V11,$T$6,IF($S$7=V11,$T$7,IF($S$8=V11,$T$8)))))))","v":"Pool C2"}]
[2,2,"vs.",3,"Pool A2","vs.","Pool A3",null,null,12,2,"vs.",3,{"$f":"CONCATENATE((IF($J$4=K12,$K$4,IF($J$5=K12,$K$5,IF($J$6=K12,$K$6,IF($J$7=K12,$K$7,IF($J$8=K12,$K$8)))))))","v":"Pool B2"},"vs.",{"$f":"CONCATENATE((IF($J$4=M12,$K$4,IF($J$5=M12,$K$5,IF($J$6=M12,$K$6,IF($J$7=M12,$K$7,IF($J$8=M12,$K$8)))))))","v":"Pool B3"},null,null,22,3,"vs.",4,{"$f":"CONCATENATE((IF($S$4=T12,$T$4,IF($S$5=T12,$T$5,IF($S$6=T12,$T$6,IF($S$7=T12,$T$7,IF($S$8=T12,$T$8)))))))","v":"Pool C3"},"vs.",{"$f":"CONCATENATE((IF($S$4=V12,$T$4,IF($S$5=V12,$T$5,IF($S$6=V12,$T$6,IF($S$7=V12,$T$7,IF($S$8=V12,$T$8)))))))","v":"Pool C4"}]
[3,1,"vs.",3,"Pool A1","vs.","Pool A3",null,null,13,1,"vs.",3,"Pool B1","vs.","Pool B3",null,null,23,1,"vs.",3,"Pool C1","vs.","Pool C3"]
[4,4,"vs.",5,"Pool A4","vs.","Pool A5",null,null,14,4,"vs.",5,"Pool B4","vs.","Pool B5",null,null,24,2,"vs.",4,"Pool C2","vs.","Pool C4"]
[5,3,"vs.",5,"Pool A3","vs.","Pool A5",null,null,15,3,"vs.",5,"Pool B3","vs.","Pool B5",null,null,25,1,"vs.",4,"Pool C1","vs.","Pool C4"]
[6,1,"vs.",2,"Pool A1","vs.","Pool A2",null,null,16,1,"vs.",2,"Pool B1","vs.","Pool B2",null,null,26,2,"vs.",3,"Pool C2","vs.","Pool C3"]
[7,2,"vs.",5,"Pool A2","vs.","Pool A5",null,null,17,2,"vs.",5,"Pool B2","vs.","Pool B5"]
[8,3,"vs.",4,"Pool A3","vs.","Pool A4",null,null,18,3,"vs.",4,"Pool B3","vs.","Pool B4"]
[9,2,"vs.",4,"Pool A2","vs.","Pool A4",null,null,19,2,"vs.",4,"Pool B2","vs.","Pool B4"]
[10,1,"vs.",5,"Pool A1","vs.","Pool A5",null,null,20,1,"vs.",5,"Pool B1","vs.","Pool B5"]

{"sheet":"15 team","index":22,"n_rows":20,"n_cols":33,"rows_kept":20,"cut":false,"hidden":false,"merged":[[4,1,4,5],[4,6,4,8],[5,1,5,5],[0,0,0,8],[1,0,1,8],[2,1,2,5],[2,6,2,8],[3,1,3,5],[3,6,3,8],[5,6,5,8],[6,1,6,5],[6,6,6,8],[7,1,7,5],[7,6,7,8],[9,4,9,6],[0,9,0,17],[1,9,1,17],[2,10,2,14],[2,15,2,17],[3,10,3,14],[3,15,3,17],[4,15,4,17],[5,10,5,14],[5,15,5,17],[6,10,6,14],[6,15,6,17],[7,10,7,14],[7,15,7,17],[9,13,9,15],[0,18,0,26],[1,18,1,26],[2,19,2,23],[2,24,2,26],[3,19,3,23],[3,24,3,26],[4,19,4,23],[4,24,4,26],[5,19,5,23],[5,24,5,26],[6,19,6,23],[6,24,6,26],[4,10,4,14],[7,19,7,23],[7,24,7,26],[9,22,9,24],[0,27,0,32],[1,27,1,32],[3,28,3,30],[6,28,6,30]]}
["15 Team Bracket",null,null,null,null,null,null,null,null,{"$f":"A1","v":"15 Team Bracket"},null,null,null,null,null,null,null,null,{"$f":"J1","v":"15 Team Bracket"},null,null,null,null,null,null,null,null,{"$f":"A1","v":"15 Team Bracket"}]
["Pool A",null,null,null,null,null,null,null,null,"Pool B",null,null,null,null,null,null,null,null,"Pool C",null,null,null,null,null,null,null,null,"Playoffs"]
["Team","Name",null,null,null,null,"Contact",null,null,"Team","Name",null,null,null,null,"Contact",null,null,"Team","Name",null,null,null,null,"Contact"]
[1,"Pool A1",null,null,null,null,null,null,null,1,"Pool B1",null,null,null,null,null,null,null,1,"Pool C1",null,null,null,null,null,null,null,"Game","Semi-Final Game",null,null,"Court","Time"]
[2,"Pool A2",null,null,null,null,null,null,null,2,"Pool B2",null,null,null,null,null,null,null,2,"Pool C2",null,null,null,null,null,null,null,31,"#2 Seeded Pool Winner","vs.","#3 Seeded Pool Winner"]
[3,"Pool A3",null,null,null,null,null,null,null,3,"Pool B3",null,null,null,null,null,null,null,3,"Pool C3"]
[4,"Pool A4",null,null,null,null,null,null,null,4,"Pool B4",null,null,null,null,null,null,null,4,"Pool C4",null,null,null,null,null,null,null,"Game","Championship Game",null,null,"Court","Time"]
[5,"Pool A5",null,null,null,null,null,null,null,5,"Pool B5",null,null,null,null,null,null,null,5,"Pool C5",null,null,null,null,null,null,null,32,"#1 Seeded Pool Winner","vs.","Winner of Game 31"]
[]
["Game",null,null,null,"Teams",null,null,"Court","Time","Game",null,null,null,"Teams",null,null,"Court","Time","Game",null,null,null,"Teams",null,null,"Court","Time"]
[1,1,"vs.",4,{"$f":"CONCATENATE((IF($A$4=B11,$B$4,IF($A$5=B11,$B$5,IF($A$6=B11,$B$6,IF($A$7=B11,$B$7,IF($A$8=B11,$B$8)))))))","v":"Pool A1"},"vs.",{"$f":"CONCATENATE((IF($A$4=D11,$B$4,IF($A$5=D11,$B$5,IF($A$6=D11,$B$6,IF($A$7=D11,$B$7,IF($A$8=D11,$B$8)))))))","v":"Pool A4"},null,null,11,1,"vs.",4,{"$f":"CONCATENATE((IF($J$4=K11,$K$4,IF($J$5=K11,$K$5,IF($J$6=K11,$K$6,IF($J$7=K11,$K$7,IF($J$8=K11,$K$8)))))))","v":"Pool B1"},"vs.",{"$f":"CONCATENATE((IF($J$4=M11,$K$4,IF($J$5=M11,$K$5,IF($J$6=M11,$K$6,IF($J$7=M11,$K$7,IF($J$8=M11,$K$8)))))))","v":"Pool B4"},null,null,21,1,"vs.",4,{"$f":"CONCATENATE((IF($S$4=T11,$T$4,IF($S$5=T11,$T$5,IF($S$6=T11,$T$6,IF($S$7=T11,$T$7,IF($S$8=T11,$T$8)))))))","v":"Pool C1"},"vs.",{"$f":"CONCATENATE((IF($S$4=V11,$T$4,IF($S$5=V11,$T$5,IF($S$6=V11,$T$6,IF($S$7=V11,$T$7,IF($S$8=V11,$T$8)))))))","v":"Pool C4"}]
[2,2,"vs.",3,{"$f":"CONCATENATE((IF($A$4=B12,$B$4,IF($A$5=B12,$B$5,IF($A$6=B12,$B$6,IF($A$7=B12,$B$7,IF($A$8=B12,$B$8)))))))","v":"Pool A2"},"vs.",{"$f":"CONCATENATE((IF($A$4=D12,$B$4,IF($A$5=D12,$B$5,IF($A$6=D12,$B$6,IF($A$7=D12,$B$7,IF($A$8=D12,$B$8)))))))","v":"Pool A3"},null,null,12,2,"vs.",3,"Pool B2","vs.",{"$f":"CONCATENATE((IF($J$4=M12,$K$4,IF($J$5=M12,$K$5,IF($J$6=M12,$K$6,IF($J$7=M12,$K$7,IF($J$8=M12,$K$8)))))))","v":"Pool B3"},null,null,22,2,"vs.",3,{"$f":"CONCATENATE((IF($S$4=T12,$T$4,IF($S$5=T12,$T$5,IF($S$6=T12,$T$6,IF($S$7=T12,$T$7,IF($S$8=T12,$T$8)))))))","v":"Pool C2"},"vs.",{"$f":"CONCATENATE((IF($S$4=V12,$T$4,IF($S$5=V12,$T$5,IF($S$6=V12,$T$6,IF($S$7=V12,$T$7,IF($S$8=V12,$T$8)))))))","v":"Pool C3"}]
[3,1,"vs.",3,"Pool A1","vs.","Pool A3",null,null,13,1,"vs.",3,"Pool B1","vs.","Pool B3",null,null,23,1,"vs.",3,"Pool C1","vs.","Pool C3"]
[4,4,"vs.",5,"Pool A4","vs.","Pool A5",null,null,14,4,"vs.",5,"Pool B4","vs.","Pool B5",null,null,24,4,"vs.",5,"Pool C4","vs.","Pool C5"]
[5,3,"vs.",5,"Pool A3","vs.","Pool A5",null,null,15,3,"vs.",5,"Pool B3","vs.","Pool B5",null,null,25,3,"vs.",5,"Pool C3","vs.","Pool C5"]
[6,1,"vs.",2,"Pool A1","vs.","Pool A2",null,null,16,1,"vs.",2,"Pool B1","vs.","Pool B2",null,null,26,1,"vs.",2,"Pool C1","vs.","Pool C2"]
[7,2,"vs.",5,"Pool A2","vs.","Pool A5",null,null,17,2,"vs.",5,"Pool B2","vs.","Pool B5",null,null,27,2,"vs.",5,"Pool C2","vs.","Pool C5"]
[8,3,"vs.",4,"Pool A3","vs.","Pool A4",null,null,18,3,"vs.",4,"Pool B3","vs.","Pool B4",null,null,28,3,"vs.",4,"Pool C3","vs.","Pool C4"]
[9,2,"vs.",4,"Pool A2","vs.","Pool A4",null,null,19,2,"vs.",4,"Pool B2","vs.","Pool B4",null,null,29,2,"vs.",4,"Pool C2","vs.","Pool C4"]
[10,1,"vs.",5,"Pool A1","vs.","Pool A5",null,null,20,1,"vs.",5,"Pool B1","vs.","Pool B5",null,null,30,1,"vs.",5,"Pool C1","vs.","Pool C5"]

{"sheet":"16 team","index":23,"n_rows":15,"n_cols":42,"rows_kept":15,"cut":false,"hidden":false,"merged":[[0,36,0,41],[1,36,1,41],[3,37,3,39],[0,27,0,35],[1,27,1,35],[7,37,7,39],[2,33,2,35],[3,28,3,32],[3,33,3,35],[4,28,4,32],[4,33,4,35],[5,28,5,32],[5,33,5,35],[2,28,2,32],[6,28,6,32],[6,33,6,35],[6,24,6,26],[5,1,5,5],[5,6,5,8],[5,10,5,14],[5,15,5,17],[5,19,5,23],[5,24,5,26],[6,1,6,5],[6,6,6,8],[6,10,6,14],[6,15,6,17],[6,19,6,23],[4,24,4,26],[3,1,3,5],[3,6,3,8],[3,10,3,14],[3,15,3,17],[3,19,3,23],[3,24,3,26],[4,1,4,5],[4,6,4,8],[4,10,4,14],[4,15,4,17],[4,19,4,23],[2,24,2,26],[0,0,0,8],[0,9,0,17],[0,18,0,26],[1,0,1,8],[1,9,1,17],[1,18,1,26],[2,1,2,5],[2,6,2,8],[2,10,2,14],[2,15,2,17],[2,19,2,23]]}
["16 Team Bracket",null,null,null,null,null,null,null,null,{"$f":"A1","v":"16 Team Bracket"},null,null,null,null,null,null,null,null,{"$f":"J1","v":"16 Team Bracket"},null,null,null,null,null,null,null,null,{"$f":"S1","v":"16 Team Bracket"},null,null,null,null,null,null,null,null,{"$f":"A1","v":"16 Team Bracket"}]
["Pool A",null,null,null,null,null,null,null,null,"Pool B",null,null,null,null,null,null,null,null,"Pool C",null,null,null,null,null,null,null,null,"Pool D",null,null,null,null,null,null,null,null,"Playoffs"]
["Team","Name",null,null,null,null,"Contact",null,null,"Team","Name",null,null,null,null,"Contact",null,null,"Team","Name",null,null,null,null,"Contact",null,null,"Team","Name",null,null,null,null,"Contact"]
[1,"Pool A1",null,null,null,null,null,null,null,1,"Pool B1",null,null,null,null,null,null,null,1,"Pool C1",null,null,null,null,null,null,null,1,"Pool D1",null,null,null,null,null,null,null,"Game","Semi-Final Games",null,null,"Court","Time"]
[2,"Pool A2",null,null,null,null,null,null,null,2,"Pool B2",null,null,null,null,null,null,null,2,"Pool C2",null,null,null,null,null,null,null,2,"Pool D2",null,null,null,null,null,null,null,25,"Pool A #1 Seed","vs.","Pool B #1 Seed"]
[3,"Pool A3",null,null,null,null,null,null,null,3,"Pool B3",null,null,null,null,null,null,null,3,"Pool C3",null,null,null,null,null,null,null,3,"Pool D3",null,null,null,null,null,null,null,26,"Pool C #1 Seed","vs.","Pool D #1 Seed"]
[4,"Pool A4",null,null,null,null,null,null,null,4,"Pool B4",null,null,null,null,null,null,null,4,"Pool C4",null,null,null,null,null,null,null,4,"Pool D4"]
[null,null,null,null,null,null,null,null,null,null,null,null,null,null,null,null,null,null,null,null,null,null,null,null,null,null,null,null,null,null,null,null,null,null,null,null,"Game","Championship Game",null,null,"Court","Time"]
["Game",null,null,null,"Teams",null,null,"Court","Time","Game",null,null,null,"Teams",null,null,"Court","Time","Game",null,null,null,"Teams",null,null,"Court","Time","Game",null,null,null,"Teams",null,null,"Court","Time",27,"Winner Game 25","vs.","Winner Game 26"]
[1,1,"vs.",2,{"$f":"CONCATENATE((IF($A$4=B10,$B$4,IF($A$5=B10,$B$5,IF($A$6=B10,$B$6,IF($A$7=B10,$B$7))))))","v":"Pool A1"},"vs.",{"$f":"CONCATENATE(IF($A$4=D10,$B$4,IF($A$5=D10,$B$5,IF($A$6=D10,$B$6,IF($A$7=D10,$B$7)))))","v":"Pool A2"},null,null,7,1,"vs.",2,{"$f":"CONCATENATE((IF($J$4=K10,$K$4,IF($J$5=K10,$K$5,IF($J$6=K10,$K$6,IF($J$7=K10,$K$7))))))","v":"Pool B1"},"vs.",{"$f":"CONCATENATE((IF($J$4=M10,$K$4,IF($J$5=M10,$K$5,IF($J$6=M10,$K$6,IF($J$7=M10,$K$7))))))","v":"Pool B2"},null,null,13,1,"vs.",2,{"$f":"CONCATENATE((IF($S$4=T10,$T$4,IF($S$5=T10,$T$5,IF($S$6=T10,$T$6,IF($S$7=T10,$T$7))))))","v":"Pool C1"},"vs.",{"$f":"CONCATENATE((IF($S$4=V10,$T$4,IF($S$5=V10,$T$5,IF($S$6=V10,$T$6,IF($S$7=V10,$T$7))))))","v":"Pool C2"},null,null,19,1,"vs.",2,{"$f":"CONCATENATE((IF($AB$4=AC10,$AC$4,IF($AB$5=AC10,$AC$5,IF($AB$6=AC10,$AC$6,IF($AB$7=AC10,$AC$7))))))","v":"Pool D1"},"vs.",{"$f":"CONCATENATE((IF($AB$4=AE10,$AC$4,IF($AB$5=AE10,$AC$5,IF($AB$6=AE10,$AC$6,IF($AB$7=AE10,$AC$7))))))","v":"Pool D2"}]
[2,3,"vs.",4,{"$f":"CONCATENATE((IF($A$4=B11,$B$4,IF($A$5=B11,$B$5,IF($A$6=B11,$B$6,IF($A$7=B11,$B$7))))))","v":"Pool A3"},"vs.",{"$f":"CONCATENATE(IF($A$4=D11,$B$4,IF($A$5=D11,$B$5,IF($A$6=D11,$B$6,IF($A$7=D11,$B$7)))))","v":"Pool A4"},null,null,8,3,"vs.",4,{"$f":"CONCATENATE((IF($J$4=K11,$K$4,IF($J$5=K11,$K$5,IF($J$6=K11,$K$6,IF($J$7=K11,$K$7))))))","v":"Pool B3"},"vs.",{"$f":"CONCATENATE((IF($J$4=M11,$K$4,IF($J$5=M11,$K$5,IF($J$6=M11,$K$6,IF($J$7=M11,$K$7))))))","v":"Pool B4"},null,null,14,3,"vs.",4,{"$f":"CONCATENATE((IF($S$4=T11,$T$4,IF($S$5=T11,$T$5,IF($S$6=T11,$T$6,IF($S$7=T11,$T$7))))))","v":"Pool C3"},"vs.",{"$f":"CONCATENATE((IF($S$4=V11,$T$4,IF($S$5=V11,$T$5,IF($S$6=V11,$T$6,IF($S$7=V11,$T$7))))))","v":"Pool C4"},null,null,20,3,"vs.",4,{"$f":"CONCATENATE((IF($AB$4=AC11,$AC$4,IF($AB$5=AC11,$AC$5,IF($AB$6=AC11,$AC$6,IF($AB$7=AC11,$AC$7))))))","v":"Pool D3"},"vs.",{"$f":"CONCATENATE((IF($AB$4=AE11,$AC$4,IF($AB$5=AE11,$AC$5,IF($AB$6=AE11,$AC$6,IF($AB$7=AE11,$AC$7))))))","v":"Pool D4"}]
[3,1,"vs.",3,"Pool A1","vs.","Pool A3",null,null,9,1,"vs.",3,"Pool B1","vs.","Pool B3",null,null,15,1,"vs.",3,"Pool C1","vs.","Pool C3",null,null,21,1,"vs.",3,"Pool D1","vs.","Pool D3"]
[4,2,"vs.",4,"Pool A2","vs.","Pool A4",null,null,10,2,"vs.",4,"Pool B2","vs.","Pool B4",null,null,16,2,"vs.",4,"Pool C2","vs.","Pool C4",null,null,22,2,"vs.",4,"Pool D2","vs.","Pool D4"]
[5,1,"vs.",4,"Pool A1","vs.","Pool A4",null,null,11,1,"vs.",4,"Pool B1","vs.","Pool B4",null,null,17,1,"vs.",4,"Pool C1","vs.","Pool C4",null,null,23,1,"vs.",4,"Pool D1","vs.","Pool D4"]
[6,2,"vs.",3,"Pool A2","vs.","Pool A3",null,null,12,2,"vs.",3,"Pool B2","vs.","Pool B3",null,null,18,2,"vs.",3,"Pool C2","vs.","Pool C3",null,null,24,2,"vs.",3,"Pool D2","vs.","Pool D3"]

{"sheet":"17 team","index":24,"n_rows":20,"n_cols":42,"rows_kept":20,"cut":false,"hidden":false,"merged":[[9,4,9,6],[30,0,30,1],[30,3,30,6],[7,1,7,5],[7,6,7,8],[7,10,7,14],[7,15,7,17],[7,37,7,39],[8,22,8,24],[8,31,8,33],[8,13,8,15],[5,28,5,32],[5,33,5,35],[6,1,6,5],[6,6,6,8],[6,10,6,14],[6,15,6,17],[6,19,6,23],[6,24,6,26],[6,28,6,32],[6,33,6,35],[5,1,5,5],[5,6,5,8],[5,10,5,14],[5,15,5,17],[5,19,5,23],[5,24,5,26],[3,37,3,39],[4,1,4,5],[4,6,4,8],[4,10,4,14],[4,15,4,17],[4,19,4,23],[4,24,4,26],[4,28,4,32],[4,33,4,35],[2,28,2,32],[2,33,2,35],[3,1,3,5],[3,6,3,8],[3,10,3,14],[3,15,3,17],[3,19,3,23],[3,24,3,26],[3,28,3,32],[3,33,3,35],[2,1,2,5],[2,6,2,8],[2,10,2,14],[2,15,2,17],[2,19,2,23],[2,24,2,26],[0,0,0,8],[0,9,0,17],[0,18,0,26],[0,27,0,35],[0,36,0,41],[1,0,1,8],[1,9,1,17],[1,18,1,26],[1,27,1,35],[1,36,1,41]]}
["17 Team Bracket",null,null,null,null,null,null,null,null,{"$f":"A1","v":"17 Team Bracket"},null,null,null,null,null,null,null,null,{"$f":"A1","v":"17 Team Bracket"},null,null,null,null,null,null,null,null,{"$f":"J1","v":"17 Team Bracket"},null,null,null,null,null,null,null,null,{"$f":"A1","v":"17 Team Bracket"}]
["Pool A",null,null,null,null,null,null,null,null,"Pool B",null,null,null,null,null,null,null,null,"Pool C",null,null,null,null,null,null,null,null,"Pool D",null,null,null,null,null,null,null,null,"Playoffs"]
["Team","Name",null,null,null,null,"Contact",null,null,"Team","Name",null,null,null,null,"Contact",null,null,"Team","Name",null,null,null,null,"Contact",null,null,"Team","Name",null,null,null,null,"Contact"]
[1,"Pool A1",null,null,null,null,null,null,null,1,"Pool B1",null,null,null,null,null,null,null,1,"Pool C1",null,null,null,null,null,null,null,1,"Pool D1",null,null,null,null,null,null,null,"Game","Semi-Final Games",null,null,"Court","Time"]
[2,"Pool A2",null,null,null,null,null,null,null,2,"Pool B2",null,null,null,null,null,null,null,2,"Pool C2",null,null,null,null,null,null,null,2,"Pool D2",null,null,null,null,null,null,null,29,"Pool A #1 Seed","vs.","Pool B #1 Seed"]
[3,"Pool A3",null,null,null,null,null,null,null,3,"Pool B3",null,null,null,null,null,null,null,3,"Pool C3",null,null,null,null,null,null,null,3,"Pool D3",null,null,null,null,null,null,null,30,"Pool C #1 Seed","vs.","Pool D #1 Seed"]
[4,"Pool A4",null,null,null,null,null,null,null,4,"Pool B4",null,null,null,null,null,null,null,4,"Pool C4",null,null,null,null,null,null,null,4,"Pool D4"]
[5,"Pool A5",null,null,null,null,null,null,null,null,null,null,null,null,null,null,null,null,null,null,null,null,null,null,null,null,null,null,null,null,null,null,null,null,null,null,"Game","Championship Game",null,null,"Court","Time"]
[null,null,null,null,null,null,null,null,null,"Game",null,null,null,"Teams",null,null,"Court","Time","Game",null,null,null,"Teams",null,null,"Court","Time","Game",null,null,null,"Teams",null,null,"Court","Time",31,"Winner Game 29","vs.","Winner Game 30"]
["Game",null,null,null,"Teams",null,null,"Court","Time",11,1,"vs.",2,{"$f":"CONCATENATE((IF($J$4=K10,$K$4,IF($J$5=K10,$K$5,IF($J$6=K10,$K$6,IF($J$7=K10,$K$7,IF($J$8=K10,$K$8)))))))","v":"Pool B1"},"vs.",{"$f":"CONCATENATE((IF($J$4=M10,$K$4,IF($J$5=M10,$K$5,IF($J$6=M10,$K$6,IF($J$7=M10,$K$7,IF($J$8=M10,$K$8)))))))","v":"Pool B2"},null,null,17,1,"vs.",2,{"$f":"CONCATENATE((IF($S$4=T10,$T$4,IF($S$5=T10,$T$5,IF($S$6=T10,$T$6,IF($S$7=T10,$T$7,\"?\"))))))","v":"Pool C1"},"vs.",{"$f":"CONCATENATE((IF($S$4=V10,$T$4,IF($S$5=V10,$T$5,IF($S$6=V10,$T$6,IF($S$7=V10,$T$7,\"?\"))))))","v":"Pool C2"},null,null,23,1,"vs.",2,{"$f":"CONCATENATE((IF($AB$4=AC10,$AC$4,IF($AB$5=AC10,$AC$5,IF($AB$6=AC10,$AC$6,IF($AB$7=AC10,$AC$7,\"?\"))))))","v":"Pool D1"},"vs.",{"$f":"CONCATENATE((IF($AB$4=AE10,$AC$4,IF($AB$5=AE10,$AC$5,IF($AB$6=AE10,$AC$6,IF($AB$7=AE10,$AC$7,\"?\"))))))","v":"Pool D2"}]
[1,1,"vs.",4,{"$f":"CONCATENATE((IF($A$4=B11,$B$4,IF($A$5=B11,$B$5,IF($A$6=B11,$B$6,IF($A$7=B11,$B$7,IF($A$8=B11,$B$8)))))))","v":"Pool A1"},"vs.",{"$f":"CONCATENATE((IF($A$4=D11,$B$4,IF($A$5=D11,$B$5,IF($A$6=D11,$B$6,IF($A$7=D11,$B$7,IF($A$8=D11,$B$8)))))))","v":"Pool A4"},null,null,12,3,"vs.",4,"Pool B3","vs.","Pool B4",null,null,18,3,"vs.",4,{"$f":"CONCATENATE((IF($S$4=T11,$T$4,IF($S$5=T11,$T$5,IF($S$6=T11,$T$6,IF($S$7=T11,$T$7,\"?\"))))))","v":"Pool C3"},"vs.","Pool C4",null,null,24,3,"vs.",4,{"$f":"CONCATENATE((IF($AB$4=AC11,$AC$4,IF($AB$5=AC11,$AC$5,IF($AB$6=AC11,$AC$6,IF($AB$7=AC11,$AC$7,\"?\"))))))","v":"Pool D3"},"vs.",{"$f":"CONCATENATE((IF($AB$4=AE11,$AC$4,IF($AB$5=AE11,$AC$5,IF($AB$6=AE11,$AC$6,IF($AB$7=AE11,$AC$7,\"?\"))))))","v":"Pool D4"}]
[2,2,"vs.",3,{"$f":"CONCATENATE((IF($A$4=B12,$B$4,IF($A$5=B12,$B$5,IF($A$6=B12,$B$6,IF($A$7=B12,$B$7,IF($A$8=B12,$B$8)))))))","v":"Pool A2"},"vs.",{"$f":"CONCATENATE((IF($A$4=D12,$B$4,IF($A$5=D12,$B$5,IF($A$6=D12,$B$6,IF($A$7=D12,$B$7,IF($A$8=D12,$B$8)))))))","v":"Pool A3"},null,null,13,1,"vs.",3,"Pool B1","vs.","Pool B3",null,null,19,1,"vs.",3,"Pool C1","vs.","Pool C3",null,null,25,1,"vs.",3,"Pool D1","vs.","Pool D3"]
[3,1,"vs.",3,"Pool A1","vs.","Pool A3",null,null,14,2,"vs.",4,"Pool B2","vs.","Pool B4",null,null,20,2,"vs.",4,"Pool C2","vs.","Pool C4",null,null,26,2,"vs.",4,"Pool D2","vs.","Pool D4"]
[4,4,"vs.",5,"Pool A4","vs.","Pool A5",null,null,15,1,"vs.",4,"Pool B1","vs.","Pool B4",null,null,21,1,"vs.",4,"Pool C1","vs.","Pool C4",null,null,27,1,"vs.",4,"Pool D1","vs.","Pool D4"]
[5,3,"vs.",5,"Pool A3","vs.","Pool A5",null,null,16,2,"vs.",3,"Pool B2","vs.","Pool B3",null,null,22,2,"vs.",3,"Pool C2","vs.","Pool C3",null,null,28,2,"vs.",3,"Pool D2","vs.","Pool D3"]
[6,1,"vs.",2,"Pool A1","vs.","Pool A2"]
[7,2,"vs.",5,"Pool A2","vs.","Pool A5"]
[8,3,"vs.",4,"Pool A3","vs.","Pool A4"]
[9,2,"vs.",4,"Pool A2","vs.","Pool A4"]
[10,1,"vs.",5,"Pool A1","vs.","Pool A5"]

{"sheet":"18 team","index":25,"n_rows":20,"n_cols":42,"rows_kept":20,"cut":false,"hidden":false,"merged":[[7,1,7,5],[7,6,7,8],[9,4,9,6],[30,0,30,1],[30,3,30,6],[4,1,4,5],[4,6,4,8],[5,1,5,5],[5,6,5,8],[6,1,6,5],[6,6,6,8],[0,0,0,8],[1,0,1,8],[2,1,2,5],[2,6,2,8],[3,1,3,5],[3,6,3,8],[0,9,0,17],[1,9,1,17],[2,10,2,14],[2,15,2,17],[3,10,3,14],[3,15,3,17],[4,10,4,14],[4,15,4,17],[5,10,5,14],[5,15,5,17],[6,10,6,14],[6,15,6,17],[4,19,4,23],[4,24,4,26],[5,19,5,23],[5,24,5,26],[6,19,6,23],[6,24,6,26],[0,18,0,26],[1,18,1,26],[2,19,2,23],[2,24,2,26],[3,19,3,23],[3,24,3,26],[6,33,6,35],[8,31,8,33],[7,10,7,14],[7,15,7,17],[9,13,9,15],[0,36,0,41],[1,36,1,41],[3,37,3,39],[7,37,7,39],[8,22,8,24],[0,27,0,35],[1,27,1,35],[2,28,2,32],[2,33,2,35],[3,28,3,32],[3,33,3,35],[4,28,4,32],[4,33,4,35],[5,28,5,32],[5,33,5,35],[6,28,6,32]]}
["18 Team Bracket",null,null,null,null,null,null,null,null,{"$f":"A1","v":"18 Team Bracket"},null,null,null,null,null,null,null,null,{"$f":"A1","v":"18 Team Bracket"},null,null,null,null,null,null,null,null,{"$f":"J1","v":"18 Team Bracket"},null,null,null,null,null,null,null,null,{"$f":"A1","v":"18 Team Bracket"}]
["Pool A",null,null,null,null,null,null,null,null,"Pool B",null,null,null,null,null,null,null,null,"Pool C",null,null,null,null,null,null,null,null,"Pool D",null,null,null,null,null,null,null,null,"Playoffs"]
["Team","Name",null,null,null,null,"Contact",null,null,"Team","Name",null,null,null,null,"Contact",null,null,"Team","Name",null,null,null,null,"Contact",null,null,"Team","Name",null,null,null,null,"Contact"]
[1,"Pool A1",null,null,null,null,null,null,null,1,"Pool B1",null,null,null,null,null,null,null,1,"Pool C1",null,null,null,null,null,null,null,1,"Pool D1",null,null,null,null,null,null,null,"Game","Semi-Final Games",null,null,"Court","Time"]
[2,"Pool A2",null,null,null,null,null,null,null,2,"Pool B2",null,null,null,null,null,null,null,2,"Pool C2",null,null,null,null,null,null,null,2,"Pool D2",null,null,null,null,null,null,null,33,"Pool A #1 Seed","vs.","Pool B #1 Seed"]
[3,"Pool A3",null,null,null,null,null,null,null,3,"Pool B3",null,null,null,null,null,null,null,3,"Pool C3",null,null,null,null,null,null,null,3,"Pool D3",null,null,null,null,null,null,null,34,"Pool C #1 Seed","vs.","Pool D #1 Seed"]
[4,"Pool A4",null,null,null,null,null,null,null,4,"Pool B4",null,null,null,null,null,null,null,4,"Pool C4",null,null,null,null,null,null,null,4,"Pool D4"]
[5,"Pool A5",null,null,null,null,null,null,null,5,"Pool B5",null,null,null,null,null,null,null,null,null,null,null,null,null,null,null,null,null,null,null,null,null,null,null,null,null,"Game","Championship Game",null,null,"Court","Time"]
[null,null,null,null,null,null,null,null,null,null,null,null,null,null,null,null,null,null,"Game",null,null,null,"Teams",null,null,"Court","Time","Game",null,null,null,"Teams",null,null,"Court","Time",35,"Winner Game 33","vs.","Winner Game 34"]
["Game",null,null,null,"Teams",null,null,"Court","Time","Game",null,null,null,"Teams",null,null,"Court","Time",21,1,"vs.",2,{"$f":"CONCATENATE((IF($S$4=T10,$T$4,IF($S$5=T10,$T$5,IF($S$6=T10,$T$6,IF($S$7=T10,$T$7,\"?\"))))))","v":"Pool C1"},"vs.",{"$f":"CONCATENATE((IF($S$4=V10,$T$4,IF($S$5=V10,$T$5,IF($S$6=V10,$T$6,IF($S$7=V10,$T$7,\"?\"))))))","v":"Pool C2"},null,null,27,1,"vs.",2,{"$f":"CONCATENATE((IF($AB$4=AC10,$AC$4,IF($AB$5=AC10,$AC$5,IF($AB$6=AC10,$AC$6,IF($AB$7=AC10,$AC$7,\"?\"))))))","v":"Pool D1"},"vs.",{"$f":"CONCATENATE((IF($AB$4=AE10,$AC$4,IF($AB$5=AE10,$AC$5,IF($AB$6=AE10,$AC$6,IF($AB$7=AE10,$AC$7,\"?\"))))))","v":"Pool D2"}]
[1,1,"vs.",4,{"$f":"CONCATENATE((IF($A$4=B11,$B$4,IF($A$5=B11,$B$5,IF($A$6=B11,$B$6,IF($A$7=B11,$B$7,IF($A$8=B11,$B$8)))))))","v":"Pool A1"},"vs.",{"$f":"CONCATENATE((IF($A$4=D11,$B$4,IF($A$5=D11,$B$5,IF($A$6=D11,$B$6,IF($A$7=D11,$B$7,IF($A$8=D11,$B$8)))))))","v":"Pool A4"},null,null,11,1,"vs.",4,{"$f":"CONCATENATE((IF($J$4=K11,$K$4,IF($J$5=K11,$K$5,IF($J$6=K11,$K$6,IF($J$7=K11,$K$7,IF($J$8=K11,$K$8)))))))","v":"Pool B1"},"vs.",{"$f":"CONCATENATE((IF($J$4=M11,$K$4,IF($J$5=M11,$K$5,IF($J$6=M11,$K$6,IF($J$7=M11,$K$7,IF($J$8=M11,$K$8)))))))","v":"Pool B4"},null,null,22,3,"vs.",4,{"$f":"CONCATENATE((IF($S$4=T11,$T$4,IF($S$5=T11,$T$5,IF($S$6=T11,$T$6,IF($S$7=T11,$T$7,\"?\"))))))","v":"Pool C3"},"vs.","Pool C4",null,null,28,3,"vs.",4,{"$f":"CONCATENATE((IF($AB$4=AC11,$AC$4,IF($AB$5=AC11,$AC$5,IF($AB$6=AC11,$AC$6,IF($AB$7=AC11,$AC$7,\"?\"))))))","v":"Pool D3"},"vs.",{"$f":"CONCATENATE((IF($AB$4=AE11,$AC$4,IF($AB$5=AE11,$AC$5,IF($AB$6=AE11,$AC$6,IF($AB$7=AE11,$AC$7,\"?\"))))))","v":"Pool D4"}]
[2,2,"vs.",3,{"$f":"CONCATENATE((IF($A$4=B12,$B$4,IF($A$5=B12,$B$5,IF($A$6=B12,$B$6,IF($A$7=B12,$B$7,IF($A$8=B12,$B$8)))))))","v":"Pool A2"},"vs.",{"$f":"CONCATENATE((IF($A$4=D12,$B$4,IF($A$5=D12,$B$5,IF($A$6=D12,$B$6,IF($A$7=D12,$B$7,IF($A$8=D12,$B$8)))))))","v":"Pool A3"},null,null,12,2,"vs.",3,{"$f":"CONCATENATE((IF($J$4=K12,$K$4,IF($J$5=K12,$K$5,IF($J$6=K12,$K$6,IF($J$7=K12,$K$7,IF($J$8=K12,$K$8)))))))","v":"Pool B2"},"vs.",{"$f":"CONCATENATE((IF($J$4=M12,$K$4,IF($J$5=M12,$K$5,IF($J$6=M12,$K$6,IF($J$7=M12,$K$7,IF($J$8=M12,$K$8)))))))","v":"Pool B3"},null,null,23,1,"vs.",3,"Pool C1","vs.","Pool C3",null,null,29,1,"vs.",3,"Pool D1","vs.","Pool D3"]
[3,1,"vs.",3,"Pool A1","vs.","Pool A3",null,null,13,1,"vs.",3,"Pool B1","vs.","Pool B3",null,null,24,2,"vs.",4,"Pool C2","vs.","Pool C4",null,null,30,2,"vs.",4,"Pool D2","vs.","Pool D4"]
[4,4,"vs.",5,"Pool A4","vs.","Pool A5",null,null,14,4,"vs.",5,"Pool B4","vs.","Pool B5",null,null,25,1,"vs.",4,"Pool C1","vs.","Pool C4",null,null,31,1,"vs.",4,"Pool D1","vs.","Pool D4"]
[5,3,"vs.",5,"Pool A3","vs.","Pool A5",null,null,15,3,"vs.",5,"Pool B3","vs.","Pool B5",null,null,26,2,"vs.",3,"Pool C2","vs.","Pool C3",null,null,32,2,"vs.",3,"Pool D2","vs.","Pool D3"]
[6,1,"vs.",2,"Pool A1","vs.","Pool A2",null,null,16,1,"vs.",2,"Pool B1","vs.","Pool B2"]
[7,2,"vs.",5,"Pool A2","vs.","Pool A5",null,null,17,2,"vs.",5,"Pool B2","vs.","Pool B5"]
[8,3,"vs.",4,"Pool A3","vs.","Pool A4",null,null,18,3,"vs.",4,"Pool B3","vs.","Pool B4"]
[9,2,"vs.",4,"Pool A2","vs.","Pool A4",null,null,19,2,"vs.",4,"Pool B2","vs.","Pool B4"]
[10,1,"vs.",5,"Pool A1","vs.","Pool A5",null,null,20,1,"vs.",5,"Pool B1","vs.","Pool B5"]

{"sheet":"19 Team","index":26,"n_rows":20,"n_cols":42,"rows_kept":20,"cut":false,"hidden":false,"merged":[[5,1,5,5],[5,6,5,8],[7,1,7,5],[7,6,7,8],[6,1,6,5],[6,6,6,8],[0,0,0,8],[0,9,0,17],[0,18,0,26],[0,27,0,35],[0,36,0,41],[1,36,1,41],[2,1,2,5],[2,6,2,8],[2,10,2,14],[2,15,2,17],[2,19,2,23],[2,24,2,26],[2,28,2,32],[2,33,2,35],[1,0,1,8],[1,9,1,17],[1,18,1,26],[1,27,1,35],[3,37,3,39],[4,1,4,5],[4,6,4,8],[4,10,4,14],[4,15,4,17],[4,19,4,23],[4,24,4,26],[4,28,4,32],[4,33,4,35],[3,10,3,14],[3,15,3,17],[3,19,3,23],[3,24,3,26],[3,28,3,32],[3,1,3,5],[3,6,3,8],[5,33,5,35],[6,24,6,26],[6,28,6,32],[6,33,6,35],[3,33,3,35],[5,10,5,14],[5,15,5,17],[5,19,5,23],[5,24,5,26],[5,28,5,32],[6,10,6,14],[6,15,6,17],[6,19,6,23],[7,37,7,39],[8,31,8,33],[7,24,7,26],[30,0,30,1],[30,3,30,6],[7,19,7,23],[9,22,9,24],[7,10,7,14],[7,15,7,17],[9,4,9,6],[9,13,9,15]]}
["19 Team Bracket",null,null,null,null,null,null,null,null,{"$f":"A1","v":"19 Team Bracket"},null,null,null,null,null,null,null,null,{"$f":"J1","v":"19 Team Bracket"},null,null,null,null,null,null,null,null,{"$f":"J1","v":"19 Team Bracket"},null,null,null,null,null,null,null,null,{"$f":"A1","v":"19 Team Bracket"}]
["Pool A",null,null,null,null,null,null,null,null,"Pool B",null,null,null,null,null,null,null,null,"Pool C",null,null,null,null,null,null,null,null,"Pool D",null,null,null,null,null,null,null,null,"Playoffs"]
["Team","Name",null,null,null,null,"Contact",null,null,"Team","Name",null,null,null,null,"Contact",null,null,"Team","Name",null,null,null,null,"Contact",null,null,"Team","Name",null,null,null,null,"Contact"]
[1,"Pool A1",null,null,null,null,null,null,null,1,"Pool B1",null,null,null,null,null,null,null,1,"Pool C1",null,null,null,null,null,null,null,1,"Pool D1",null,null,null,null,null,null,null,"Game","Semi-Final Games",null,null,"Court","Time"]
[2,"Pool A2",null,null,null,null,null,null,null,2,"Pool B2",null,null,null,null,null,null,null,2,"Pool C2",null,null,null,null,null,null,null,2,"Pool D2",null,null,null,null,null,null,null,37,"Pool A #1 Seed","vs.","Pool B #1 Seed"]
[3,"Pool A3",null,null,null,null,null,null,null,3,"Pool B3",null,null,null,null,null,null,null,3,"Pool C3",null,null,null,null,null,null,null,3,"Pool D3",null,null,null,null,null,null,null,38,"Pool C #1 Seed","vs.","Pool D #1 Seed"]
[4,"Pool A4",null,null,null,null,null,null,null,4,"Pool B4",null,null,null,null,null,null,null,4,"Pool C4",null,null,null,null,null,null,null,4,"Pool D4"]
[5,"Pool A5",null,null,null,null,null,null,null,5,"Pool B5",null,null,null,null,null,null,null,5,"Pool C5",null,null,null,null,null,null,null,null,null,null,null,null,null,null,null,null,"Game","Championship Game",null,null,"Court","Time"]
[null,null,null,null,null,null,null,null,null,null,null,null,null,null,null,null,null,null,null,null,null,null,null,null,null,null,null,"Game",null,null,null,"Teams",null,null,"Court","Time",39,"Winner Game 33","vs.","Winner Game 34"]
["Game",null,null,null,"Teams",null,null,"Court","Time","Game",null,null,null,"Teams",null,null,"Court","Time","Game",null,null,null,"Teams",null,null,"Court","Time",31,1,"vs.",2,{"$f":"CONCATENATE((IF($AB$4=AC10,$AC$4,IF($AB$5=AC10,$AC$5,IF($AB$6=AC10,$AC$6,IF($AB$7=AC10,$AC$7,\"?\"))))))","v":"Pool D1"},"vs.",{"$f":"CONCATENATE((IF($AB$4=AE10,$AC$4,IF($AB$5=AE10,$AC$5,IF($AB$6=AE10,$AC$6,IF($AB$7=AE10,$AC$7,\"?\"))))))","v":"Pool D2"}]
[1,1,"vs.",4,{"$f":"CONCATENATE((IF($A$4=B11,$B$4,IF($A$5=B11,$B$5,IF($A$6=B11,$B$6,IF($A$7=B11,$B$7,IF($A$8=B11,$B$8)))))))","v":"Pool A1"},"vs.",{"$f":"CONCATENATE((IF($A$4=D11,$B$4,IF($A$5=D11,$B$5,IF($A$6=D11,$B$6,IF($A$7=D11,$B$7,IF($A$8=D11,$B$8)))))))","v":"Pool A4"},null,null,11,1,"vs.",4,{"$f":"CONCATENATE((IF($J$4=K11,$K$4,IF($J$5=K11,$K$5,IF($J$6=K11,$K$6,IF($J$7=K11,$K$7,IF($J$8=K11,$K$8)))))))","v":"Pool B1"},"vs.",{"$f":"CONCATENATE((IF($J$4=M11,$K$4,IF($J$5=M11,$K$5,IF($J$6=M11,$K$6,IF($J$7=M11,$K$7,IF($J$8=M11,$K$8)))))))","v":"Pool B4"},null,null,21,1,"vs.",4,{"$f":"CONCATENATE((IF($S$4=T11,$T$4,IF($S$5=T11,$T$5,IF($S$6=T11,$T$6,IF($S$7=T11,$T$7,IF($S$8=T11,$T$8)))))))","v":"Pool C1"},"vs.",{"$f":"CONCATENATE((IF($S$4=V11,$T$4,IF($S$5=V11,$T$5,IF($S$6=V11,$T$6,IF($S$7=V11,$T$7,IF($S$8=V11,$T$8)))))))","v":"Pool C4"},null,null,32,3,"vs.",4,{"$f":"CONCATENATE((IF($AB$4=AC11,$AC$4,IF($AB$5=AC11,$AC$5,IF($AB$6=AC11,$AC$6,IF($AB$7=AC11,$AC$7,\"?\"))))))","v":"Pool D3"},"vs.",{"$f":"CONCATENATE((IF($AB$4=AE11,$AC$4,IF($AB$5=AE11,$AC$5,IF($AB$6=AE11,$AC$6,IF($AB$7=AE11,$AC$7,\"?\"))))))","v":"Pool D4"}]
[2,2,"vs.",3,{"$f":"CONCATENATE((IF($A$4=B12,$B$4,IF($A$5=B12,$B$5,IF($A$6=B12,$B$6,IF($A$7=B12,$B$7,IF($A$8=B12,$B$8)))))))","v":"Pool A2"},"vs.",{"$f":"CONCATENATE((IF($A$4=D12,$B$4,IF($A$5=D12,$B$5,IF($A$6=D12,$B$6,IF($A$7=D12,$B$7,IF($A$8=D12,$B$8)))))))","v":"Pool A3"},null,null,12,2,"vs.",3,{"$f":"CONCATENATE((IF($J$4=K12,$K$4,IF($J$5=K12,$K$5,IF($J$6=K12,$K$6,IF($J$7=K12,$K$7,IF($J$8=K12,$K$8)))))))","v":"Pool B2"},"vs.",{"$f":"CONCATENATE((IF($J$4=M12,$K$4,IF($J$5=M12,$K$5,IF($J$6=M12,$K$6,IF($J$7=M12,$K$7,IF($J$8=M12,$K$8)))))))","v":"Pool B3"},null,null,22,2,"vs.",3,{"$f":"CONCATENATE((IF($S$4=T12,$T$4,IF($S$5=T12,$T$5,IF($S$6=T12,$T$6,IF($S$7=T12,$T$7,IF($S$8=T12,$T$8)))))))","v":"Pool C2"},"vs.",{"$f":"CONCATENATE((IF($S$4=V12,$T$4,IF($S$5=V12,$T$5,IF($S$6=V12,$T$6,IF($S$7=V12,$T$7,IF($S$8=V12,$T$8)))))))","v":"Pool C3"},null,null,33,1,"vs.",3,"Pool D1","vs.","Pool D3"]
[3,1,"vs.",3,"Pool A1","vs.","Pool A3",null,null,13,1,"vs.",3,"Pool B1","vs.","Pool B3",null,null,23,1,"vs.",3,"Pool C1","vs.","Pool C3",null,null,34,2,"vs.",4,"Pool D2","vs.","Pool D4"]
[4,4,"vs.",5,"Pool A4","vs.","Pool A5",null,null,14,4,"vs.",5,"Pool B4","vs.","Pool B5",null,null,24,4,"vs.",5,"Pool C4","vs.","Pool C5",null,null,35,1,"vs.",4,"Pool D1","vs.","Pool D4"]
[5,3,"vs.",5,"Pool A3","vs.","Pool A5",null,null,15,3,"vs.",5,"Pool B3","vs.","Pool B5",null,null,25,3,"vs.",5,"Pool C3","vs.","Pool C5",null,null,36,2,"vs.",3,"Pool D2","vs.","Pool D3"]
[6,1,"vs.",2,"Pool A1","vs.","Pool A2",null,null,16,1,"vs.",2,"Pool B1","vs.","Pool B2",null,null,26,1,"vs.",2,"Pool C1","vs.","Pool C2"]
[7,2,"vs.",5,"Pool A2","vs.","Pool A5",null,null,17,2,"vs.",5,"Pool B2","vs.","Pool B5",null,null,27,2,"vs.",5,"Pool C2","vs.","Pool C5"]
[8,3,"vs.",4,"Pool A3","vs.","Pool A4",null,null,18,3,"vs.",4,"Pool B3","vs.","Pool B4",null,null,28,3,"vs.",4,"Pool C3","vs.","Pool C4"]
[9,2,"vs.",4,"Pool A2","vs.","Pool A4",null,null,19,2,"vs.",4,"Pool B2","vs.","Pool B4",null,null,29,2,"vs.",4,"Pool C2","vs.","Pool C4"]
[10,1,"vs.",5,"Pool A1","vs.","Pool A5",null,null,20,1,"vs.",5,"Pool B1","vs.","Pool B5",null,null,30,1,"vs.",5,"Pool C1","vs.","Pool C5"]

{"sheet":"20 team(5 Pools of 4)","index":27,"n_rows":15,"n_cols":51,"rows_kept":15,"cut":false,"hidden":false,"merged":[[25,0,25,1],[25,3,25,6],[4,1,4,5],[4,6,4,8],[5,1,5,5],[5,6,5,8],[6,1,6,5],[6,6,6,8],[8,4,8,6],[2,1,2,5],[2,6,2,8],[3,1,3,5],[3,6,3,8],[55,3,55,5],[55,6,55,7],[49,3,49,5],[49,6,49,7],[50,3,50,5],[50,6,50,7],[54,3,54,5],[54,6,54,7],[37,0,37,1],[37,3,37,6],[51,3,51,5],[51,6,51,7],[1,9,1,17],[2,10,2,14],[2,15,2,17],[3,10,3,14],[3,15,3,17],[8,13,8,15],[0,0,0,8],[1,0,1,8],[0,18,0,26],[1,18,1,26],[2,19,2,23],[2,24,2,26],[3,19,3,23],[3,24,3,26],[4,10,4,14],[4,15,4,17],[5,10,5,14],[5,15,5,17],[6,10,6,14],[6,15,6,17],[0,9,0,17],[0,27,0,35],[1,27,1,35],[2,28,2,32],[2,33,2,35],[3,28,3,32],[3,33,3,35],[3,37,3,41],[3,42,3,44],[8,22,8,24],[4,28,4,32],[4,33,4,35],[5,28,5,32],[5,33,5,35],[6,28,6,32],[6,33,6,35],[8,31,8,33],[4,19,4,23],[4,24,4,26],[5,19,5,23],[5,24,5,26],[6,19,6,23],[6,24,6,26],[10,46,10,48],[8,40,8,42],[0,45,0,50],[1,45,1,50],[3,46,3,48],[6,46,6,48],[4,37,4,41],[4,42,4,44],[5,37,5,41],[5,42,5,44],[6,37,6,41],[6,42,6,44],[0,36,0,44],[1,36,1,44],[2,37,2,41],[2,42,2,44]]}
["20 Team Bracket (5 Pools of 4)",null,null,null,null,null,null,null,null,{"$f":"A1","v":"20 Team Bracket (5 Pools of 4)"},null,null,null,null,null,null,null,null,{"$f":"A1","v":"20 Team Bracket (5 Pools of 4)"},null,null,null,null,null,null,null,null,{"$f":"A1","v":"20 Team Bracket (5 Pools of 4)"},null,null,null,null,null,null,null,null,{"$f":"A1","v":"20 Team Bracket (5 Pools of 4)"},null,null,null,null,null,null,null,null,{"$f":"A1","v":"20 Team Bracket (5 Pools of 4)"}]
["Pool A",null,null,null,null,null,null,null,null,"Pool B",null,null,null,null,null,null,null,null,"Pool C",null,null,null,null,null,null,null,null,"Pool D",null,null,null,null,null,null,null,null,"Pool E",null,null,null,null,null,null,null,null,"Playoffs"]
["Team","Name",null,null,null,null,"Contact",null,null,"Team","Name",null,null,null,null,"Contact",null,null,"Team","Name",null,null,null,null,"Contact",null,null,"Team","Name",null,null,null,null,"Contact",null,null,"Team","Name",null,null,null,null,"Contact"]
[1,"Pool A1",null,null,null,null,null,null,null,1,"Pool B1",null,null,null,null,null,null,null,1,"Pool C1",null,null,null,null,null,null,null,1,"Pool D1",null,null,null,null,null,null,null,1,"Pool E1",null,null,null,null,null,null,null,"Game","Play-in Game",null,null,"Court","Time"]
[2,"Pool A2",null,null,null,null,null,null,null,2,"Pool B2",null,null,null,null,null,null,null,2,"Pool C2",null,null,null,null,null,null,null,2,"Pool D2",null,null,null,null,null,null,null,2,"Pool E2",null,null,null,null,null,null,null,31,"#4 Seed Pool Winner","vs.","#5 Seed Pool Winner"]
[3,"Pool A3",null,null,null,null,null,null,null,3,"Pool B3",null,null,null,null,null,null,null,3,"Pool C3",null,null,null,null,null,null,null,3,"Pool D3",null,null,null,null,null,null,null,3,"Pool E3"]
[4,"Pool A4",null,null,null,null,null,null,null,4,"Pool B4",null,null,null,null,null,null,null,4,"Pool C4",null,null,null,null,null,null,null,4,"Pool D4",null,null,null,null,null,null,null,4,"Pool E4",null,null,null,null,null,null,null,"Game","Semi-Final Games",null,null,"Court","Time"]
[null,null,null,null,null,null,null,null,null,null,null,null,null,null,null,null,null,null,null,null,null,null,null,null,null,null,null,null,null,null,null,null,null,null,null,null,null,null,null,null,null,null,null,null,null,32,"Winner Game 31","vs.","#1 Seed Pool Winner"]
["Game",null,null,null,"Teams",null,null,"Court","Time","Game",null,null,null,"Teams",null,null,"Court","Time","Game",null,null,null,"Teams",null,null,"Court","Time","Game",null,null,null,"Teams",null,null,"Court","Time","Game",null,null,null,"Teams",null,null,"Court","Time",33,"#2 Seed Pool Winner","vs.","#3 Seed Pool Winner"]
[1,1,"vs.",2,{"$f":"CONCATENATE((IF($A$4=B10,$B$4,IF($A$5=B10,$B$5,IF($A$6=B10,$B$6,IF($A$7=B10,$B$7,\"?\"))))))","v":"Pool A1"},"vs.",{"$f":"CONCATENATE((IF($A$4=D10,$B$4,IF($A$5=D10,$B$5,IF($A$6=D10,$B$6,IF($A$7=D10,$B$7,\"?\"))))))","v":"Pool A2"},null,null,7,1,"vs.",2,{"$f":"CONCATENATE((IF($J$4=K10,$K$4,IF($J$5=K10,$K$5,IF($J$6=K10,$K$6,IF($J$7=K10,$K$7,\"?\"))))))","v":"Pool B1"},"vs.",{"$f":"CONCATENATE((IF($J$4=M10,$K$4,IF($J$5=M10,$K$5,IF($J$6=M10,$K$6,IF($J$7=M10,$K$7,\"?\"))))))","v":"Pool B2"},null,null,13,1,"vs.",2,{"$f":"CONCATENATE((IF($S$4=T10,$T$4,IF($S$5=T10,$T$5,IF($S$6=T10,$T$6,IF($S$7=T10,$T$7,\"?\"))))))","v":"Pool C1"},"vs.",{"$f":"CONCATENATE((IF($S$4=V10,$T$4,IF($S$5=V10,$T$5,IF($S$6=V10,$T$6,IF($S$7=V10,$T$7,\"?\"))))))","v":"Pool C2"},null,null,19,1,"vs.",2,{"$f":"CONCATENATE((IF($AB$4=AC10,$AC$4,IF($AB$5=AC10,$AC$5,IF($AB$6=AC10,$AC$6,IF($AB$7=AC10,$AC$7,\"?\"))))))","v":"Pool D1"},"vs.",{"$f":"CONCATENATE((IF($AB$4=AE10,$AC$4,IF($AB$5=AE10,$AC$5,IF($AB$6=AE10,$AC$6,IF($AB$7=AE10,$AC$7,\"?\"))))))","v":"Pool D2"},null,null,25,1,"vs.",2,{"$f":"CONCATENATE((IF($AK$4=AL10,$AL$4,IF($AK$5=AL10,$AL$5,IF($AK$6=AL10,$AL$6,IF($AK$7=AL10,$AL$7,\"?\"))))))","v":"Pool E1"},"vs.",{"$f":"CONCATENATE((IF($AK$4=AN10,$AL$4,IF($AK$5=AN10,$AL$5,IF($AK$6=AN10,$AL$6,IF($AK$7=AN10,$AL$7,\"?\"))))))","v":"Pool E2"}]
[2,3,"vs.",4,{"$f":"CONCATENATE((IF($A$4=B11,$B$4,IF($A$5=B11,$B$5,IF($A$6=B11,$B$6,IF($A$7=B11,$B$7,\"?\"))))))","v":"Pool A3"},"vs.","Pool A4",null,null,8,3,"vs.",4,{"$f":"CONCATENATE((IF($J$4=K11,$K$4,IF($J$5=K11,$K$5,IF($J$6=K11,$K$6,IF($J$7=K11,$K$7,\"?\"))))))","v":"Pool B3"},"vs.",{"$f":"CONCATENATE((IF($J$4=M11,$K$4,IF($J$5=M11,$K$5,IF($J$6=M11,$K$6,IF($J$7=M11,$K$7,\"?\"))))))","v":"Pool B4"},null,null,14,3,"vs.",4,{"$f":"CONCATENATE((IF($S$4=T11,$T$4,IF($S$5=T11,$T$5,IF($S$6=T11,$T$6,IF($S$7=T11,$T$7,\"?\"))))))","v":"Pool C3"},"vs.",{"$f":"CONCATENATE((IF($S$4=V11,$T$4,IF($S$5=V11,$T$5,IF($S$6=V11,$T$6,IF($S$7=V11,$T$7,\"?\"))))))","v":"Pool C4"},null,null,20,3,"vs.",4,{"$f":"CONCATENATE((IF($AB$4=AC11,$AC$4,IF($AB$5=AC11,$AC$5,IF($AB$6=AC11,$AC$6,IF($AB$7=AC11,$AC$7,\"?\"))))))","v":"Pool D3"},"vs.",{"$f":"CONCATENATE((IF($AB$4=AE11,$AC$4,IF($AB$5=AE11,$AC$5,IF($AB$6=AE11,$AC$6,IF($AB$7=AE11,$AC$7,\"?\"))))))","v":"Pool D4"},null,null,26,3,"vs.",4,{"$f":"CONCATENATE((IF($AK$4=AL11,$AL$4,IF($AK$5=AL11,$AL$5,IF($AK$6=AL11,$AL$6,IF($AK$7=AL11,$AL$7,\"?\"))))))","v":"Pool E3"},"vs.",{"$f":"CONCATENATE((IF($AK$4=AN11,$AL$4,IF($AK$5=AN11,$AL$5,IF($AK$6=AN11,$AL$6,IF($AK$7=AN11,$AL$7,\"?\"))))))","v":"Pool E4"},null,null,"Game","Championship Game",null,null,"Court","Time"]
[3,1,"vs.",3,"Pool A1","vs.","Pool A3",null,null,9,1,"vs.",3,"Pool B1","vs.","Pool B3",null,null,15,1,"vs.",3,"Pool C1","vs.","Pool C3",null,null,21,1,"vs.",3,"Pool D1","vs.","Pool D3",null,null,27,1,"vs.",3,"Pool E1","vs.","Pool E3",null,null,34,"Winner Game 32","vs.","Winner Game 33"]
[4,2,"vs.",4,"Pool A2","vs.","Pool A4",null,null,10,2,"vs.",4,"Pool B2","vs.","Pool B4",null,null,16,2,"vs.",4,"Pool C2","vs.","Pool C4",null,null,22,2,"vs.",4,"Pool D2","vs.","Pool D4",null,null,28,2,"vs.",4,"Pool E2","vs.","Pool E4"]
[5,1,"vs.",4,"Pool A1","vs.","Pool A4",null,null,11,1,"vs.",4,"Pool B1","vs.","Pool B4",null,null,17,1,"vs.",4,"Pool C1","vs.","Pool C4",null,null,23,1,"vs.",4,"Pool D1","vs.","Pool D4",null,null,29,1,"vs.",4,"Pool E1","vs.","Pool E4"]
[6,2,"vs.",3,"Pool A2","vs.","Pool A3",null,null,12,2,"vs.",3,"Pool B2","vs.","Pool B3",null,null,18,2,"vs.",3,"Pool C2","vs.","Pool C3",null,null,24,2,"vs.",3,"Pool D2","vs.","Pool D3",null,null,30,2,"vs.",3,"Pool E2","vs.","Pool E3"]

{"sheet":"21 team","index":28,"n_rows":23,"n_cols":42,"rows_kept":23,"cut":false,"hidden":false,"merged":[[0,36,0,41],[1,36,1,41],[3,37,3,39],[7,37,7,39],[9,22,9,24],[0,27,0,35],[1,27,1,35],[2,28,2,32],[2,33,2,35],[3,28,3,32],[3,33,3,35],[4,28,4,32],[4,33,4,35],[5,28,5,32],[5,33,5,35],[6,28,6,32],[6,33,6,35],[7,28,7,32],[7,33,7,35],[9,31,9,33],[5,19,5,23],[5,24,5,26],[6,19,6,23],[6,24,6,26],[7,19,7,23],[7,24,7,26],[7,10,7,14],[7,15,7,17],[9,13,9,15],[0,18,0,26],[1,18,1,26],[2,19,2,23],[2,24,2,26],[3,19,3,23],[3,24,3,26],[4,19,4,23],[4,10,4,14],[4,15,4,17],[5,10,5,14],[5,15,5,17],[6,10,6,14],[4,24,4,26],[6,15,6,17],[0,9,0,17],[1,9,1,17],[2,10,2,14],[2,15,2,17],[3,10,3,14],[3,15,3,17],[0,0,0,8],[1,0,1,8],[2,1,2,5],[2,6,2,8],[3,1,3,5],[3,6,3,8],[4,1,4,5],[4,6,4,8],[5,1,5,5],[5,6,5,8],[6,1,6,5],[6,6,6,8],[7,1,7,5],[7,6,7,8],[8,1,8,5],[8,6,8,8],[10,4,10,6]]}
["21 Team Bracket",null,null,null,null,null,null,null,null,{"$f":"A1","v":"21 Team Bracket"},null,null,null,null,null,null,null,null,{"$f":"A1","v":"21 Team Bracket"},null,null,null,null,null,null,null,null,{"$f":"A1","v":"21 Team Bracket"},null,null,null,null,null,null,null,null,{"$f":"A1","v":"21 Team Bracket"}]
["Pool A",null,null,null,null,null,null,null,null,"Pool B",null,null,null,null,null,null,null,null,"Pool C",null,null,null,null,null,null,null,null,"Pool D",null,null,null,null,null,null,null,null,"Playoffs"]
["Team","Name",null,null,null,null,"Contact",null,null,"Team","Name",null,null,null,null,"Contact",null,null,"Team","Name",null,null,null,null,"Contact",null,null,"Team","Name",null,null,null,null,"Contact"]
[1,"Pool A1",null,null,null,null,null,null,null,1,"Pool B1",null,null,null,null,null,null,null,1,"Pool C1",null,null,null,null,null,null,null,1,"Pool D1",null,null,null,null,null,null,null,"Game","Semi-Final Games",null,null,"Court","Time"]
[2,"Pool A2",null,null,null,null,null,null,null,2,"Pool B2",null,null,null,null,null,null,null,2,"Pool C2",null,null,null,null,null,null,null,2,"Pool D2",null,null,null,null,null,null,null,43,"Pool A #1 Seed","vs.","Pool B #1 Seed"]
[3,"Pool A3",null,null,null,null,null,null,null,3,"Pool B3",null,null,null,null,null,null,null,3,"Pool C3",null,null,null,null,null,null,null,3,"Pool D3",null,null,null,null,null,null,null,44,"Pool C #1 Seed","vs.","Pool D #1 Seed"]
[4,"Pool A4",null,null,null,null,null,null,null,4,"Pool B4",null,null,null,null,null,null,null,4,"Pool C4",null,null,null,null,null,null,null,4,"Pool D4"]
[5,"Pool A5",null,null,null,null,null,null,null,5,"Pool B5",null,null,null,null,null,null,null,5,"Pool C5",null,null,null,null,null,null,null,5,"Pool D5",null,null,null,null,null,null,null,"Game","Championship Game",null,null,"Court","Time"]
[6,"Pool A6",null,null,null,null,null,null,null,null,null,null,null,null,null,null,null,null,null,null,null,null,null,null,null,null,null,null,null,null,null,null,null,null,null,null,45,"Winner Game 43","vs.","Winner Game 44"]
[null,null,null,null,null,null,null,null,null,"Game",null,null,null,"Teams",null,null,"Court","Time","Game",null,null,null,"Teams",null,null,"Court","Time","Game",null,null,null,"Teams",null,null,"Court","Time"]
["Game",null,null,null,"Teams",null,null,"Court","Time",13,1,"vs.",4,{"$f":"CONCATENATE((IF($J$4=K11,$K$4,IF($J$5=K11,$K$5,IF($J$6=K11,$K$6,IF($J$7=K11,$K$7,IF($J$8=K11,$K$8)))))))","v":"Pool B1"},"vs.",{"$f":"CONCATENATE((IF($J$4=M11,$K$4,IF($J$5=M11,$K$5,IF($J$6=M11,$K$6,IF($J$7=M11,$K$7,IF($J$8=M11,$K$8)))))))","v":"Pool B4"},null,null,23,1,"vs.",4,{"$f":"CONCATENATE((IF($S$4=T11,$T$4,IF($S$5=T11,$T$5,IF($S$6=T11,$T$6,IF($S$7=T11,$T$7,IF($S$8=T11,$T$8)))))))","v":"Pool C1"},"vs.",{"$f":"CONCATENATE((IF($S$4=V11,$T$4,IF($S$5=V11,$T$5,IF($S$6=V11,$T$6,IF($S$7=V11,$T$7,IF($S$8=V11,$T$8)))))))","v":"Pool C4"},null,null,33,1,"vs.",4,{"$f":"CONCATENATE((IF($AB$4=AC11,$AC$4,IF($AB$5=AC11,$AC$5,IF($AB$6=AC11,$AC$6,IF($AB$7=AC11,$AC$7,IF($AB$8=AC11,$AC$8)))))))","v":"Pool D1"},"vs.",{"$f":"CONCATENATE((IF($AB$4=AE11,$AC$4,IF($AB$5=AE11,$AC$5,IF($AB$6=AE11,$AC$6,IF($AB$7=AE11,$AC$7,IF($AB$8=AE11,$AC$8)))))))","v":"Pool D4"}]
[1,1,"vs.",6,{"$f":"CONCATENATE((IF($A$4=B12,$B$4,IF($A$5=B12,$B$5,IF($A$6=B12,$B$6,IF($A$7=B12,$B$7,IF($A$8=B12,$B$8,IF($A$9=B12,$B$9))))))))","v":"Pool A1"},"vs.",{"$f":"CONCATENATE((IF($A$4=D12,$B$4,IF($A$5=D12,$B$5,IF($A$6=D12,$B$6,IF($A$7=D12,$B$7,IF($A$8=D12,$B$8,IF($A$9=D12,$B$9))))))))","v":"Pool A6"},null,null,14,2,"vs.",3,{"$f":"CONCATENATE((IF($J$4=K12,$K$4,IF($J$5=K12,$K$5,IF($J$6=K12,$K$6,IF($J$7=K12,$K$7,IF($J$8=K12,$K$8)))))))","v":"Pool B2"},"vs.",{"$f":"CONCATENATE((IF($J$4=M12,$K$4,IF($J$5=M12,$K$5,IF($J$6=M12,$K$6,IF($J$7=M12,$K$7,IF($J$8=M12,$K$8)))))))","v":"Pool B3"},null,null,24,2,"vs.",3,{"$f":"CONCATENATE((IF($S$4=T12,$T$4,IF($S$5=T12,$T$5,IF($S$6=T12,$T$6,IF($S$7=T12,$T$7,IF($S$8=T12,$T$8)))))))","v":"Pool C2"},"vs.",{"$f":"CONCATENATE((IF($S$4=V12,$T$4,IF($S$5=V12,$T$5,IF($S$6=V12,$T$6,IF($S$7=V12,$T$7,IF($S$8=V12,$T$8)))))))","v":"Pool C3"},null,null,34,2,"vs.",3,{"$f":"CONCATENATE((IF($AB$4=AC12,$AC$4,IF($AB$5=AC12,$AC$5,IF($AB$6=AC12,$AC$6,IF($AB$7=AC12,$AC$7,IF($AB$8=AC12,$AC$8)))))))","v":"Pool D2"},"vs.",{"$f":"CONCATENATE((IF($AB$4=AE12,$AC$4,IF($AB$5=AE12,$AC$5,IF($AB$6=AE12,$AC$6,IF($AB$7=AE12,$AC$7,IF($AB$8=AE12,$AC$8)))))))","v":"Pool D3"}]
[2,2,"vs.",5,{"$f":"CONCATENATE((IF($A$4=B13,$B$4,IF($A$5=B13,$B$5,IF($A$6=B13,$B$6,IF($A$7=B13,$B$7,IF($A$8=B13,$B$8)))))))","v":"Pool A2"},"vs.",{"$f":"CONCATENATE((IF($A$4=D13,$B$4,IF($A$5=D13,$B$5,IF($A$6=D13,$B$6,IF($A$7=D13,$B$7,IF($A$8=D13,$B$8,IF($A$9=D13,$B$9))))))))","v":"Pool A5"},null,null,15,1,"vs.",3,"Pool B1","vs.","Pool B3",null,null,25,1,"vs.",3,"Pool C1","vs.","Pool C3",null,null,35,1,"vs.",3,"Pool D1","vs.","Pool D3"]
[3,3,"vs.",4,"Pool A3","vs.","Pool A4",null,null,16,4,"vs.",5,"Pool B4","vs.","Pool B5",null,null,26,4,"vs.",5,"Pool C4","vs.","Pool C5",null,null,36,4,"vs.",5,"Pool D4","vs.","Pool D5"]
[4,1,"vs.",5,"Pool A1","vs.","Pool A5",null,null,17,3,"vs.",5,"Pool B3","vs.","Pool B5",null,null,27,3,"vs.",5,"Pool C3","vs.","Pool C5",null,null,37,3,"vs.",5,"Pool D3","vs.","Pool D5"]
[5,2,"vs.",4,"Pool A2","vs.","Pool A4",null,null,18,1,"vs.",2,"Pool B1","vs.","Pool B2",null,null,28,1,"vs.",2,"Pool C1","vs.","Pool C2",null,null,38,1,"vs.",2,"Pool D1","vs.","Pool D2"]
[6,3,"vs.",6,"Pool A3","vs.","Pool A6",null,null,19,2,"vs.",5,"Pool B2","vs.","Pool B5",null,null,29,2,"vs.",5,"Pool C2","vs.","Pool C5",null,null,39,2,"vs.",5,"Pool D2","vs.","Pool D5"]
[7,1,"vs.",4,"Pool A1","vs.","Pool A4",null,null,20,3,"vs.",4,"Pool B3","vs.","Pool B4",null,null,30,3,"vs.",4,"Pool C3","vs.","Pool C4",null,null,40,3,"vs.",4,"Pool D3","vs.","Pool D4"]
[8,2,"vs.",3,"Pool A2","vs.","Pool A3",null,null,21,2,"vs.",4,"Pool B2","vs.","Pool B4",null,null,31,2,"vs.",4,"Pool C2","vs.","Pool C4",null,null,41,2,"vs.",4,"Pool D2","vs.","Pool D4"]
[9,5,"vs.",6,"Pool A5","vs.","Pool A6",null,null,22,1,"vs.",5,"Pool B1","vs.","Pool B5",null,null,32,1,"vs.",5,"Pool C1","vs.","Pool C5",null,null,42,1,"vs.",5,"Pool D1","vs.","Pool D5"]
[10,1,"vs.",3,"Pool A1","vs.","Pool A3"]
[11,2,"vs.",6,"Pool A2","vs.","Pool A6"]
[12,4,"vs.",5,"Pool A4","vs.","Pool A5"]

{"sheet":"22 team","index":29,"n_rows":23,"n_cols":42,"rows_kept":23,"cut":false,"hidden":false,"merged":[[7,33,7,35],[7,37,7,39],[8,1,8,5],[8,6,8,8],[10,13,10,15],[9,22,9,24],[9,31,9,33],[7,1,7,5],[7,6,7,8],[7,10,7,14],[7,15,7,17],[7,19,7,23],[7,24,7,26],[10,4,10,6],[8,10,8,14],[8,15,8,17],[7,28,7,32],[5,28,5,32],[5,33,5,35],[6,1,6,5],[6,6,6,8],[6,10,6,14],[6,15,6,17],[6,19,6,23],[6,24,6,26],[6,28,6,32],[6,33,6,35],[5,1,5,5],[5,6,5,8],[5,10,5,14],[5,15,5,17],[5,19,5,23],[5,24,5,26],[3,37,3,39],[4,1,4,5],[4,6,4,8],[4,10,4,14],[4,15,4,17],[4,19,4,23],[4,24,4,26],[4,28,4,32],[4,33,4,35],[2,28,2,32],[2,33,2,35],[3,1,3,5],[3,6,3,8],[3,10,3,14],[3,15,3,17],[3,19,3,23],[3,24,3,26],[3,28,3,32],[3,33,3,35],[2,1,2,5],[2,6,2,8],[2,10,2,14],[2,15,2,17],[2,19,2,23],[2,24,2,26],[0,0,0,8],[0,9,0,17],[0,18,0,26],[0,27,0,35],[0,36,0,41],[1,0,1,8],[1,9,1,17],[1,18,1,26],[1,27,1,35],[1,36,1,41]]}
["22 Team Bracket",null,null,null,null,null,null,null,null,{"$f":"A1","v":"22 Team Bracket"},null,null,null,null,null,null,null,null,{"$f":"A1","v":"22 Team Bracket"},null,null,null,null,null,null,null,null,{"$f":"A1","v":"22 Team Bracket"},null,null,null,null,null,null,null,null,{"$f":"A1","v":"22 Team Bracket"}]
["Pool A",null,null,null,null,null,null,null,null,"Pool B",null,null,null,null,null,null,null,null,"Pool C",null,null,null,null,null,null,null,null,"Pool D",null,null,null,null,null,null,null,null,"Playoffs"]
["Team","Name",null,null,null,null,"Contact",null,null,"Team","Name",null,null,null,null,"Contact",null,null,"Team","Name",null,null,null,null,"Contact",null,null,"Team","Name",null,null,null,null,"Contact"]
[1,"Pool A1",null,null,null,null,null,null,null,1,"Pool B1",null,null,null,null,null,null,null,1,"Pool C1",null,null,null,null,null,null,null,1,"Pool D1",null,null,null,null,null,null,null,"Game","Semi-Final Games",null,null,"Court","Time"]
[2,"Pool A2",null,null,null,null,null,null,null,2,"Pool B2",null,null,null,null,null,null,null,2,"Pool C2",null,null,null,null,null,null,null,2,"Pool D2",null,null,null,null,null,null,null,45,"Pool A #1 Seed","vs.","Pool B #1 Seed"]
[3,"Pool A3",null,null,null,null,null,null,null,3,"Pool B3",null,null,null,null,null,null,null,3,"Pool C3",null,null,null,null,null,null,null,3,"Pool D3",null,null,null,null,null,null,null,46,"Pool C #1 Seed","vs.","Pool D #1 Seed"]
[4,"Pool A4",null,null,null,null,null,null,null,4,"Pool B4",null,null,null,null,null,null,null,4,"Pool C4",null,null,null,null,null,null,null,4,"Pool D4"]
[5,"Pool A5",null,null,null,null,null,null,null,5,"Pool B5",null,null,null,null,null,null,null,5,"Pool C5",null,null,null,null,null,null,null,5,"Pool D5",null,null,null,null,null,null,null,"Game","Championship Game",null,null,"Court","Time"]
[6,"Pool A6",null,null,null,null,null,null,null,6,"Pool B6",null,null,null,null,null,null,null,null,null,null,null,null,null,null,null,null,null,null,null,null,null,null,null,null,null,47,"Winner Game 43","vs.","Winner Game 44"]
[null,null,null,null,null,null,null,null,null,null,null,null,null,null,null,null,null,null,"Game",null,null,null,"Teams",null,null,"Court","Time","Game",null,null,null,"Teams",null,null,"Court","Time"]
["Game",null,null,null,"Teams",null,null,"Court","Time","Game",null,null,null,"Teams",null,null,"Court","Time",25,1,"vs.",4,{"$f":"CONCATENATE((IF($S$4=T11,$T$4,IF($S$5=T11,$T$5,IF($S$6=T11,$T$6,IF($S$7=T11,$T$7,IF($S$8=T11,$T$8)))))))","v":"Pool C1"},"vs.",{"$f":"CONCATENATE((IF($S$4=V11,$T$4,IF($S$5=V11,$T$5,IF($S$6=V11,$T$6,IF($S$7=V11,$T$7,IF($S$8=V11,$T$8)))))))","v":"Pool C4"},null,null,35,1,"vs.",4,{"$f":"CONCATENATE((IF($AB$4=AC11,$AC$4,IF($AB$5=AC11,$AC$5,IF($AB$6=AC11,$AC$6,IF($AB$7=AC11,$AC$7,IF($AB$8=AC11,$AC$8)))))))","v":"Pool D1"},"vs.",{"$f":"CONCATENATE((IF($AB$4=AE11,$AC$4,IF($AB$5=AE11,$AC$5,IF($AB$6=AE11,$AC$6,IF($AB$7=AE11,$AC$7,IF($AB$8=AE11,$AC$8)))))))","v":"Pool D4"}]
[1,1,"vs.",6,{"$f":"CONCATENATE((IF($A$4=B12,$B$4,IF($A$5=B12,$B$5,IF($A$6=B12,$B$6,IF($A$7=B12,$B$7,IF($A$8=B12,$B$8,IF($A$9=B12,$B$9))))))))","v":"Pool A1"},"vs.",{"$f":"CONCATENATE((IF($A$4=D12,$B$4,IF($A$5=D12,$B$5,IF($A$6=D12,$B$6,IF($A$7=D12,$B$7,IF($A$8=D12,$B$8,IF($A$9=D12,$B$9))))))))","v":"Pool A6"},null,null,13,1,"vs.",6,{"$f":"CONCATENATE((IF($J$4=K12,$K$4,IF($J$5=K12,$K$5,IF($J$6=K12,$K$6,IF($J$7=K12,$K$7,IF($J$8=K12,$K$8,IF($J$9=K12,$K$9))))))))","v":"Pool B1"},"vs.",{"$f":"CONCATENATE((IF($J$4=M12,$K$4,IF($J$5=M12,$K$5,IF($J$6=M12,$K$6,IF($J$7=M12,$K$7,IF($J$8=M12,$K$8,IF($J$9=M12,$K$9))))))))","v":"Pool B6"},null,null,26,2,"vs.",3,{"$f":"CONCATENATE((IF($S$4=T12,$T$4,IF($S$5=T12,$T$5,IF($S$6=T12,$T$6,IF($S$7=T12,$T$7,IF($S$8=T12,$T$8)))))))","v":"Pool C2"},"vs.",{"$f":"CONCATENATE((IF($S$4=V12,$T$4,IF($S$5=V12,$T$5,IF($S$6=V12,$T$6,IF($S$7=V12,$T$7,IF($S$8=V12,$T$8)))))))","v":"Pool C3"},null,null,36,2,"vs.",3,{"$f":"CONCATENATE((IF($AB$4=AC12,$AC$4,IF($AB$5=AC12,$AC$5,IF($AB$6=AC12,$AC$6,IF($AB$7=AC12,$AC$7,IF($AB$8=AC12,$AC$8)))))))","v":"Pool D2"},"vs.",{"$f":"CONCATENATE((IF($AB$4=AE12,$AC$4,IF($AB$5=AE12,$AC$5,IF($AB$6=AE12,$AC$6,IF($AB$7=AE12,$AC$7,IF($AB$8=AE12,$AC$8)))))))","v":"Pool D3"}]
[2,2,"vs.",5,{"$f":"CONCATENATE((IF($A$4=B13,$B$4,IF($A$5=B13,$B$5,IF($A$6=B13,$B$6,IF($A$7=B13,$B$7,IF($A$8=B13,$B$8)))))))","v":"Pool A2"},"vs.",{"$f":"CONCATENATE((IF($A$4=D13,$B$4,IF($A$5=D13,$B$5,IF($A$6=D13,$B$6,IF($A$7=D13,$B$7,IF($A$8=D13,$B$8,IF($A$9=D13,$B$9))))))))","v":"Pool A5"},null,null,14,2,"vs.",5,{"$f":"CONCATENATE((IF($J$4=K13,$K$4,IF($J$5=K13,$K$5,IF($J$6=K13,$K$6,IF($J$7=K13,$K$7,IF($J$8=K13,$K$8)))))))","v":"Pool B2"},"vs.",{"$f":"CONCATENATE((IF($J$4=M13,$K$4,IF($J$5=M13,$K$5,IF($J$6=M13,$K$6,IF($J$7=M13,$K$7,IF($J$8=M13,$K$8,IF($J$9=M13,$K$9))))))))","v":"Pool B5"},null,null,27,1,"vs.",3,"Pool C1","vs.","Pool C3",null,null,37,1,"vs.",3,"Pool D1","vs.","Pool D3"]
[3,3,"vs.",4,"Pool A3","vs.","Pool A4",null,null,15,3,"vs.",4,"Pool B3","vs.","Pool B4",null,null,28,4,"vs.",5,"Pool C4","vs.","Pool C5",null,null,38,4,"vs.",5,"Pool D4","vs.","Pool D5"]
[4,1,"vs.",5,"Pool A1","vs.","Pool A5",null,null,16,1,"vs.",5,"Pool B1","vs.","Pool B5",null,null,29,3,"vs.",5,"Pool C3","vs.","Pool C5",null,null,39,3,"vs.",5,"Pool D3","vs.","Pool D5"]
[5,2,"vs.",4,"Pool A2","vs.","Pool A4",null,null,17,2,"vs.",4,"Pool B2","vs.","Pool B4",null,null,30,1,"vs.",2,"Pool C1","vs.","Pool C2",null,null,40,1,"vs.",2,"Pool D1","vs.","Pool D2"]
[6,3,"vs.",6,"Pool A3","vs.","Pool A6",null,null,18,3,"vs.",6,"Pool B3","vs.","Pool B6",null,null,31,2,"vs.",5,"Pool C2","vs.","Pool C5",null,null,41,2,"vs.",5,"Pool D2","vs.","Pool D5"]
[7,1,"vs.",4,"Pool A1","vs.","Pool A4",null,null,19,1,"vs.",4,"Pool B1","vs.","Pool B4",null,null,32,3,"vs.",4,"Pool C3","vs.","Pool C4",null,null,42,3,"vs.",4,"Pool D3","vs.","Pool D4"]
[8,2,"vs.",3,"Pool A2","vs.","Pool A3",null,null,20,2,"vs.",3,"Pool B2","vs.","Pool B3",null,null,33,2,"vs.",4,"Pool C2","vs.","Pool C4",null,null,43,2,"vs.",4,"Pool D2","vs.","Pool D4"]
[9,5,"vs.",6,"Pool A5","vs.","Pool A6",null,null,21,5,"vs.",6,"Pool B5","vs.","Pool B6",null,null,34,1,"vs.",5,"Pool C1","vs.","Pool C5",null,null,44,1,"vs.",5,"Pool D1","vs.","Pool D5"]
[10,1,"vs.",3,"Pool A1","vs.","Pool A3",null,null,22,1,"vs.",3,"Pool B1","vs.","Pool B3"]
[11,2,"vs.",6,"Pool A2","vs.","Pool A6",null,null,23,2,"vs.",6,"Pool B2","vs.","Pool B6"]
[12,4,"vs.",5,"Pool A4","vs.","Pool A5",null,null,24,4,"vs.",5,"Pool B4","vs.","Pool B5"]

{"sheet":"25 team","index":30,"n_rows":20,"n_cols":51,"rows_kept":20,"cut":false,"hidden":false,"merged":[[10,46,10,48],[7,37,7,41],[7,42,7,44],[9,40,9,42],[0,45,0,50],[1,45,1,50],[3,46,3,48],[6,46,6,48],[4,37,4,41],[4,42,4,44],[5,37,5,41],[5,42,5,44],[6,37,6,41],[6,42,6,44],[0,36,0,44],[1,36,1,44],[2,37,2,41],[2,42,2,44],[3,37,3,41],[3,42,3,44],[5,28,5,32],[5,33,5,35],[2,28,2,32],[2,33,2,35],[9,31,9,33],[7,19,7,23],[5,10,5,14],[5,15,5,17],[5,19,5,23],[5,24,5,26],[7,24,7,26],[7,28,7,32],[7,33,7,35],[6,28,6,32],[6,33,6,35],[6,24,6,26],[6,15,6,17],[6,19,6,23],[9,22,9,24],[0,27,0,35],[1,9,1,17],[1,18,1,26],[1,27,1,35],[4,19,4,23],[4,24,4,26],[4,28,4,32],[4,33,4,35],[0,9,0,17],[0,18,0,26],[3,28,3,32],[3,33,3,35],[2,10,2,14],[2,15,2,17],[2,19,2,23],[2,24,2,26],[4,1,4,5],[5,1,5,5],[6,1,6,5],[4,6,4,8],[3,10,3,14],[6,6,6,8],[6,10,6,14],[5,6,5,8],[0,0,0,8],[1,0,1,8],[2,1,2,5],[2,6,2,8],[3,1,3,5],[3,6,3,8],[7,6,7,8],[9,4,9,6],[7,10,7,14],[7,15,7,17],[7,1,7,5],[9,13,9,15],[3,19,3,23],[3,24,3,26],[4,10,4,14],[4,15,4,17],[3,15,3,17]]}
["25 Team Bracket",null,null,null,null,null,null,null,null,{"$f":"A1","v":"25 Team Bracket"},null,null,null,null,null,null,null,null,{"$f":"A1","v":"25 Team Bracket"},null,null,null,null,null,null,null,null,{"$f":"A1","v":"25 Team Bracket"},null,null,null,null,null,null,null,null,{"$f":"A1","v":"25 Team Bracket"},null,null,null,null,null,null,null,null,{"$f":"A1","v":"25 Team Bracket"}]
["Pool A",null,null,null,null,null,null,null,null,"Pool B",null,null,null,null,null,null,null,null,"Pool C",null,null,null,null,null,null,null,null,"Pool D",null,null,null,null,null,null,null,null,"Pool E",null,null,null,null,null,null,null,null,"Playoffs"]
["Team","Name",null,null,null,null,"Contact",null,null,"Team","Name",null,null,null,null,"Contact",null,null,"Team","Name",null,null,null,null,"Contact",null,null,"Team","Name",null,null,null,null,"Contact",null,null,"Team","Name",null,null,null,null,"Contact"]
[1,"Pool A1",null,null,null,null,null,null,null,1,"Pool B1",null,null,null,null,null,null,null,1,"Pool C1",null,null,null,null,null,null,null,1,"Pool D1",null,null,null,null,null,null,null,1,"Pool E1",null,null,null,null,null,null,null,"Game","Play-in Game",null,null,"Court","Time"]
[2,"Pool A2",null,null,null,null,null,null,null,2,"Pool B2",null,null,null,null,null,null,null,2,"Pool C2",null,null,null,null,null,null,null,2,"Pool D2",null,null,null,null,null,null,null,2,"Pool E2",null,null,null,null,null,null,null,51,"#4 Seed Pool Winner","vs.","#5 Seed Pool Winner"]
[3,"Pool A3",null,null,null,null,null,null,null,3,"Pool B3",null,null,null,null,null,null,null,3,"Pool C3",null,null,null,null,null,null,null,3,"Pool D3",null,null,null,null,null,null,null,3,"Pool E3"]
[4,"Pool A4",null,null,null,null,null,null,null,4,"Pool B4",null,null,null,null,null,null,null,4,"Pool C4",null,null,null,null,null,null,null,4,"Pool D4",null,null,null,null,null,null,null,4,"Pool E4",null,null,null,null,null,null,null,"Game","Semi-Final Games",null,null,"Court","Time"]
[5,"Pool A5",null,null,null,null,null,null,null,5,"Pool B5",null,null,null,null,null,null,null,5,"Pool C5",null,null,null,null,null,null,null,5,"Pool D5",null,null,null,null,null,null,null,5,"Pool E5",null,null,null,null,null,null,null,52,"Winner Game 51","vs.","#1 Seed Pool Winner"]
[null,null,null,null,null,null,null,null,null,null,null,null,null,null,null,null,null,null,null,null,null,null,null,null,null,null,null,null,null,null,null,null,null,null,null,null,null,null,null,null,null,null,null,null,null,53,"#2 Seed Pool Winner","vs.","#3 Seed Pool Winner"]
["Game",null,null,null,"Teams",null,null,"Court","Time","Game",null,null,null,"Teams",null,null,"Court","Time","Game",null,null,null,"Teams",null,null,"Court","Time","Game",null,null,null,"Teams",null,null,"Court","Time","Game",null,null,null,"Teams",null,null,"Court","Time"]
[1,1,"vs.",4,{"$f":"CONCATENATE((IF($A$4=B11,$B$4,IF($A$5=B11,$B$5,IF($A$6=B11,$B$6,IF($A$7=B11,$B$7,IF($A$8=B11,$B$8)))))))","v":"Pool A1"},"vs.",{"$f":"CONCATENATE((IF($A$4=D11,$B$4,IF($A$5=D11,$B$5,IF($A$6=D11,$B$6,IF($A$7=D11,$B$7,IF($A$8=D11,$B$8)))))))","v":"Pool A4"},null,null,11,1,"vs.",4,{"$f":"CONCATENATE((IF($J$4=K11,$K$4,IF($J$5=K11,$K$5,IF($J$6=K11,$K$6,IF($J$7=K11,$K$7,IF($J$8=K11,$K$8)))))))","v":"Pool B1"},"vs.",{"$f":"CONCATENATE((IF($J$4=M11,$K$4,IF($J$5=M11,$K$5,IF($J$6=M11,$K$6,IF($J$7=M11,$K$7,IF($J$8=M11,$K$8)))))))","v":"Pool B4"},null,null,21,1,"vs.",4,{"$f":"CONCATENATE((IF($S$4=T11,$T$4,IF($S$5=T11,$T$5,IF($S$6=T11,$T$6,IF($S$7=T11,$T$7,IF($S$8=T11,$T$8)))))))","v":"Pool C1"},"vs.",{"$f":"CONCATENATE((IF($S$4=V11,$T$4,IF($S$5=V11,$T$5,IF($S$6=V11,$T$6,IF($S$7=V11,$T$7,IF($S$8=V11,$T$8)))))))","v":"Pool C4"},null,null,31,1,"vs.",4,{"$f":"CONCATENATE((IF($AB$4=AC11,$AC$4,IF($AB$5=AC11,$AC$5,IF($AB$6=AC11,$AC$6,IF($AB$7=AC11,$AC$7,IF($AB$8=AC11,$AC$8)))))))","v":"Pool D1"},"vs.",{"$f":"CONCATENATE((IF($AB$4=AE11,$AC$4,IF($AB$5=AE11,$AC$5,IF($AB$6=AE11,$AC$6,IF($AB$7=AE11,$AC$7,IF($AB$8=AE11,$AC$8)))))))","v":"Pool D4"},null,null,41,1,"vs.",4,{"$f":"CONCATENATE((IF($AK$4=AL11,$AL$4,IF($AK$5=AL11,$AL$5,IF($AK$6=AL11,$AL$6,IF($AK$7=AL11,$AL$7,IF($AK$8=AL11,$AL$8)))))))","v":"Pool E1"},"vs.",{"$f":"CONCATENATE((IF($AK$4=AN11,$AL$4,IF($AK$5=AN11,$AL$5,IF($AK$6=AN11,$AL$6,IF($AK$7=AN11,$AL$7,IF($AK$8=AN11,$AL$8)))))))","v":"Pool E4"},null,null,"Game","Championship Game",null,null,"Court","Time"]
[2,2,"vs.",3,{"$f":"CONCATENATE((IF($A$4=B12,$B$4,IF($A$5=B12,$B$5,IF($A$6=B12,$B$6,IF($A$7=B12,$B$7,IF($A$8=B12,$B$8)))))))","v":"Pool A2"},"vs.",{"$f":"CONCATENATE((IF($A$4=D12,$B$4,IF($A$5=D12,$B$5,IF($A$6=D12,$B$6,IF($A$7=D12,$B$7,IF($A$8=D12,$B$8)))))))","v":"Pool A3"},null,null,12,2,"vs.",3,{"$f":"CONCATENATE((IF($J$4=K12,$K$4,IF($J$5=K12,$K$5,IF($J$6=K12,$K$6,IF($J$7=K12,$K$7,IF($J$8=K12,$K$8)))))))","v":"Pool B2"},"vs.",{"$f":"CONCATENATE((IF($J$4=M12,$K$4,IF($J$5=M12,$K$5,IF($J$6=M12,$K$6,IF($J$7=M12,$K$7,IF($J$8=M12,$K$8)))))))","v":"Pool B3"},null,null,22,2,"vs.",3,{"$f":"CONCATENATE((IF($S$4=T12,$T$4,IF($S$5=T12,$T$5,IF($S$6=T12,$T$6,IF($S$7=T12,$T$7,IF($S$8=T12,$T$8)))))))","v":"Pool C2"},"vs.",{"$f":"CONCATENATE((IF($S$4=V12,$T$4,IF($S$5=V12,$T$5,IF($S$6=V12,$T$6,IF($S$7=V12,$T$7,IF($S$8=V12,$T$8)))))))","v":"Pool C3"},null,null,32,2,"vs.",3,{"$f":"CONCATENATE((IF($AB$4=AC12,$AC$4,IF($AB$5=AC12,$AC$5,IF($AB$6=AC12,$AC$6,IF($AB$7=AC12,$AC$7,IF($AB$8=AC12,$AC$8)))))))","v":"Pool D2"},"vs.",{"$f":"CONCATENATE((IF($AB$4=AE12,$AC$4,IF($AB$5=AE12,$AC$5,IF($AB$6=AE12,$AC$6,IF($AB$7=AE12,$AC$7,IF($AB$8=AE12,$AC$8)))))))","v":"Pool D3"},null,null,42,2,"vs.",3,{"$f":"CONCATENATE((IF($AK$4=AL12,$AL$4,IF($AK$5=AL12,$AL$5,IF($AK$6=AL12,$AL$6,IF($AK$7=AL12,$AL$7,IF($AK$8=AL12,$AL$8)))))))","v":"Pool E2"},"vs.",{"$f":"CONCATENATE((IF($AK$4=AN12,$AL$4,IF($AK$5=AN12,$AL$5,IF($AK$6=AN12,$AL$6,IF($AK$7=AN12,$AL$7,IF($AK$8=AN12,$AL$8)))))))","v":"Pool E3"},null,null,54,"Winner Game 52","vs.","Winner Game 54"]
[3,1,"vs.",3,"Pool A1","vs.","Pool A3",null,null,13,1,"vs.",3,"Pool B1","vs.","Pool B3",null,null,23,1,"vs.",3,"Pool C1","vs.","Pool C3",null,null,33,1,"vs.",3,"Pool D1","vs.","Pool D3",null,null,43,1,"vs.",3,"Pool E1","vs.","Pool E3"]
[4,4,"vs.",5,"Pool A4","vs.","Pool A5",null,null,14,4,"vs.",5,"Pool B4","vs.","Pool B5",null,null,24,4,"vs.",5,"Pool C4","vs.","Pool C5",null,null,34,4,"vs.",5,"Pool D4","vs.","Pool D5",null,null,44,4,"vs.",5,"Pool E4","vs.","Pool E5"]
[5,3,"vs.",5,"Pool A3","vs.","Pool A5",null,null,15,3,"vs.",5,"Pool B3","vs.","Pool B5",null,null,25,3,"vs.",5,"Pool C3","vs.","Pool C5",null,null,35,3,"vs.",5,"Pool D3","vs.","Pool D5",null,null,45,3,"vs.",5,"Pool E3","vs.","Pool E5"]
[6,1,"vs.",2,"Pool A1","vs.","Pool A2",null,null,16,1,"vs.",2,"Pool B1","vs.","Pool B2",null,null,26,1,"vs.",2,"Pool C1","vs.","Pool C2",null,null,36,1,"vs.",2,"Pool D1","vs.","Pool D2",null,null,46,1,"vs.",2,"Pool E1","vs.","Pool E2"]
[7,2,"vs.",5,"Pool A2","vs.","Pool A5",null,null,17,2,"vs.",5,"Pool B2","vs.","Pool B5",null,null,27,2,"vs.",5,"Pool C2","vs.","Pool C5",null,null,37,2,"vs.",5,"Pool D2","vs.","Pool D5",null,null,47,2,"vs.",5,"Pool E2","vs.","Pool E5"]
[8,3,"vs.",4,"Pool A3","vs.","Pool A4",null,null,18,3,"vs.",4,"Pool B3","vs.","Pool B4",null,null,28,3,"vs.",4,"Pool C3","vs.","Pool C4",null,null,38,3,"vs.",4,"Pool D3","vs.","Pool D4",null,null,48,3,"vs.",4,"Pool E3","vs.","Pool E4"]
[9,2,"vs.",4,"Pool A2","vs.","Pool A4",null,null,19,2,"vs.",4,"Pool B2","vs.","Pool B4",null,null,29,2,"vs.",4,"Pool C2","vs.","Pool C4",null,null,39,2,"vs.",4,"Pool D2","vs.","Pool D4",null,null,49,2,"vs.",4,"Pool E2","vs.","Pool E4"]
[10,1,"vs.",5,"Pool A1","vs.","Pool A5",null,null,20,1,"vs.",5,"Pool B1","vs.","Pool B5",null,null,30,1,"vs.",5,"Pool C1","vs.","Pool C5",null,null,40,1,"vs.",5,"Pool D1","vs.","Pool D5",null,null,50,1,"vs.",5,"Pool E1","vs.","Pool E5"]