{"text_format":"1","workbook":"xlsx","n_sheets":29,"sheets":["3rd_4th_Boys","3rd_4th_Girls","5th_6th_Boys","5th_6th_Girls","7th_8th_Boys","7th_8th_Girls","Saturday Games","Form_Data","3 team","4 Teams","5 team","6 Team Pool","6 Team Round","7 team","8 Teams","9 team","10 team","11 teams","12 team","13 team","14 team","15 team","16 team","17 team","18 team","19 Team","20 team(5 Pools of 4)","21 team","25 team"],"not_rendered":{"charts":0,"images":0,"macros":1,"external_links":0,"defined_names":82,"comments":0,"pivot_tables":0},"unopened":[],"bounds":{"document_bytes":16777216,"sheet_cells":100000,"rows_first":2000,"rows_last":500,"rows_between":2000,"halvings":0,"cell_chars":16384,"cell_head_chars":4096},"cells_cut":0,"cells_raw":0,"read":"whole","date_system":"1900"}

{"sheet":"3rd_4th_Boys","index":0,"n_rows":20,"n_cols":24,"rows_kept":20,"cut":false,"hidden":false,"merged":[[0,0,0,8],[0,9,0,17],[0,18,0,23],[1,0,1,8],[1,9,1,17],[1,18,1,23],[5,1,5,5],[5,6,5,8],[5,10,5,14],[5,15,5,17],[2,1,2,5],[2,6,2,8],[2,10,2,14],[2,15,2,17],[3,1,3,5],[3,6,3,8],[3,10,3,14],[3,15,3,17],[3,19,3,21],[4,1,4,5],[4,6,4,8],[4,10,4,14],[4,15,4,17],[8,13,8,15],[9,4,9,6],[6,1,6,5],[6,6,6,8],[6,10,6,14],[6,15,6,17],[7,1,7,5],[7,6,7,8]]}
["3rd 4th Grade Boys",null,null,null,null,null,null,null,null,{"$f":"A1","v":"3rd 4th Grade Boys"},null,null,null,null,null,null,null,null,{"$f":"A1","v":"3rd 4th Grade Boys"}]
["Pool A",null,null,null,null,null,null,null,null,"Pool B",null,null,null,null,null,null,null,null,"Playoffs"]
["Team","Name",null,null,null,null,"Contact",null,null,"Team","Name",null,null,null,null,"Contact"]
[1,"Freak Squad",null,null,null,null,"Danielle Charles",null,null,1,"Cardinals",null,null,null,null,"Jeff Gronner",null,null,"Game","Championship Game",null,null,"Court","Time"]
[2,"Hunters",null,null,null,null,"Aaron White",null,null,2,"Sneaky Ballerz",null,null,null,null,"Mike Phillips",null,null,17,"Pool A #1 Seed","vs.","Pool B #1 Seed",1,"3:00"]
[3,"Drummond",null,null,null,null,"Justin Christenson",null,null,3,"Alley-Opps",null,null,null,null,"Dan LaJoie"]
[4,"The Jacks",null,null,null,null,"Jeff Rothamel",null,null,4,"The Dominators",null,null,null,null,"Dan Male"]
[5,"South Ridge",null,null,null,null,"Carlye Olson"]
[null,null,null,null,null,null,null,null,null,"Game",null,null,null,"Teams",null,null,"Court","Time"]
["Game",null,null,null,"Teams",null,null,"Court","Time",11,1,"vs.",2,{"$f":"CONCATENATE((IF($J$4=K10,$K$4,IF($J$5=K10,$K$5,IF($J$6=K10,$K$6,IF($J$7=K10,$K$7,\"?\"))))))","v":"Cardinals"},"vs.",{"$f":"CONCATENATE((IF($J$4=M10,$K$4,IF($J$5=M10,$K$5,IF($J$6=M10,$K$6,IF($J$7=M10,$K$7,\"?\"))))))","v":"Sneaky Ballerz"},3,"10:00"]
[1,1,"vs.",4,{"$f":"CONCATENATE((IF($A$4=B11,$B$4,IF($A$5=B11,$B$5,IF($A$6=B11,$B$6,IF($A$7=B11,$B$7,IF($A$8=B11,$B$8)))))))","v":"Freak Squad"},"vs.",{"$f":"CONCATENATE((IF($A$4=D11,$B$4,IF($A$5=D11,$B$5,IF($A$6=D11,$B$6,IF($A$7=D11,$B$7,IF($A$8=D11,$B$8)))))))","v":"The Jacks"},1,"10:00",12,3,"vs.",4,{"$f":"CONCATENATE((IF($J$4=K11,$K$4,IF($J$5=K11,$K$5,IF($J$6=K11,$K$6,IF($J$7=K11,$K$7,\"?\"))))))","v":"Alley-Opps"},"vs.",{"$f":"CONCATENATE((IF($J$4=M11,$K$4,IF($J$5=M11,$K$5,IF($J$6=M11,$K$6,IF($J$7=M11,$K$7,\"?\"))))))","v":"The Dominators"},4,"10:00"]
[2,2,"vs.",3,{"$f":"CONCATENATE((IF($A$4=B12,$B$4,IF($A$5=B12,$B$5,IF($A$6=B12,$B$6,IF($A$7=B12,$B$7,IF($A$8=B12,$B$8)))))))","v":"Hunters"},"vs.",{"$f":"CONCATENATE((IF($A$4=D12,$B$4,IF($A$5=D12,$B$5,IF($A$6=D12,$B$6,IF($A$7=D12,$B$7,IF($A$8=D12,$B$8)))))))","v":"Drummond"},2,"10:00",13,1,"vs.",3,"Cardinals","vs.","Alley-Opps",11,"11:00"]
[3,1,"vs.",3,"Freak Squad","vs.","Drummond",9,"11:00",14,2,"vs.",4,"Sneaky Ballerz","vs.","The Dominators",12,"11:00"]
[4,4,"vs.",5,"The Jacks","vs.","South Ridge",10,"11:00",15,1,"vs.",4,"Cardinals","vs.","The Dominators",3,"12:00"]
[5,3,"vs.",5,"Drummond","vs.","South Ridge",1,"12:00",16,2,"vs.",3,"Sneaky Ballerz","vs.","Alley-Opps",4,"12:00"]
[6,1,"vs.",2,"Freak Squad","vs.","Hunters",2,"12:00"]
[7,2,"vs.",5,"Hunters","vs.","South Ridge",7,"1:00"]
[8,3,"vs.",4,"Drummond","vs.","The Jacks",8,"1:00"]
[9,2,"vs.",4,"Hunters","vs.","The Jacks",7,"2:00"]
[10,1,"vs.",5,"Freak Squad","vs.","South Ridge",8,"2:00"]

{"sheet":"3rd_4th_Girls","index":1,"n_rows":15,"n_cols":24,"rows_kept":15,"cut":false,"hidden":false,"merged":[[0,0,0,8],[0,9,0,17],[0,18,0,23],[1,0,1,8],[1,9,1,17],[1,18,1,23],[2,1,2,5],[2,6,2,8],[2,10,2,14],[2,15,2,17],[3,1,3,5],[3,6,3,8],[3,10,3,14],[3,15,3,17],[11,19,11,21],[3,19,3,21],[4,1,4,5],[4,6,4,8],[4,10,4,14],[4,15,4,17],[5,1,5,5],[5,6,5,8],[5,10,5,14],[5,15,5,17],[6,1,6,5],[6,6,6,8],[7,13,7,15],[7,19,7,21],[8,4,8,6]]}
["3rd 4th Grade Girls",null,null,null,null,null,null,null,null,{"$f":"A1","v":"3rd 4th Grade Girls"},null,null,null,null,null,null,null,null,{"$f":"J1","v":"3rd 4th Grade Girls"}]
["Pool A",null,null,null,null,null,null,null,null,"Pool B",null,null,null,null,null,null,null,null,"Playoffs"]
["Team","Name",null,null,null,null,"Contact",null,null,"Team","Name",null,null,null,null,"Contact"]
[1,"South End Heat",null,null,null,null,"John Leask",null,null,1,"Ballers, Shot Callers",null,null,null,null,"Joe Hermanson",null,null,"Game","Play-in Games",null,null,"Court","Time"]
[2,"The Jacks",null,null,null,null,"Ryanne Battaglia",null,null,2,"Baskethounds",null,null,null,null,"Justin Olesiak",null,null,10,"Pool A #2 Seed","vs.","Pool B #3 Seed",1,"1:00"]
[3,"Hawks",null,null,null,null,"Jason Young",null,null,3,"The Three-O Trio",null,null,null,null,"Pete James",null,null,11,"Pool B #2 Seed","vs.","Pool A #3 Seed",2,"1:00"]
[4,"Shooting Stars",null,null,null,null,"Michael Brown"]
[null,null,null,null,null,null,null,null,null,"Game",null,null,null,"Teams",null,null,"Court","Time","Game","Semi-Final Games",null,null,"Court","Time"]
["Game",null,null,null,"Teams",null,null,"Court","Time",7,1,"vs.",2,{"$f":"CONCATENATE((IF($J$4=K9,$K$4,IF($J$5=K9,$K$5,IF($J$6=K9,$K$6,IF($J$7=K9,$K$7,\"?\"))))))","v":"Ballers, Shot Callers"},"vs.",{"$f":"CONCATENATE((IF($J$4=M9,$K$4,IF($J$5=M9,$K$5,IF($J$6=M9,$K$6,IF($J$7=M9,$K$7,\"?\"))))))","v":"Baskethounds"},7,"10:00",12,"Winner Game 10","vs.","Pool A #1 Seed",1,"2:00"]
[1,1,"vs.",2,{"$f":"CONCATENATE((IF($A$4=B10,$B$4,IF($A$5=B10,$B$5,IF($A$6=B10,$B$6,IF($A$7=B10,$B$7,\"?\"))))))","v":"South End Heat"},"vs.",{"$f":"CONCATENATE((IF($A$4=D10,$B$4,IF($A$5=D10,$B$5,IF($A$6=D10,$B$6,IF($A$7=D10,$B$7,\"?\"))))))","v":"The Jacks"},5,"10:00",8,2,"vs.",3,{"$f":"CONCATENATE((IF($J$4=K10,$K$4,IF($J$5=K10,$K$5,IF($J$6=K10,$K$6,IF($J$7=K10,$K$7,\"?\"))))))","v":"Baskethounds"},"vs.",{"$f":"CONCATENATE((IF($J$4=M10,$K$4,IF($J$5=M10,$K$5,IF($J$6=M10,$K$6,IF($J$7=M10,$K$7,\"?\"))))))","v":"The Three-O Trio"},6,"11:00",13,"Winner Game 11","vs.","Pool B #1 Seed",2,"2:00"]
[2,3,"vs.",4,{"$f":"CONCATENATE((IF($A$4=B11,$B$4,IF($A$5=B11,$B$5,IF($A$6=B11,$B$6,IF($A$7=B11,$B$7,\"?\"))))))","v":"Hawks"},"vs.","Shooting Stars",6,"10:00",9,1,"vs.",3,{"$f":"CONCATENATE((IF($J$4=K11,$K$4,IF($J$5=K11,$K$5,IF($J$6=K11,$K$6,IF($J$7=K11,$K$7,\"?\"))))))","v":"Ballers, Shot Callers"},"vs.",{"$f":"CONCATENATE((IF($J$4=M11,$K$4,IF($J$5=M11,$K$5,IF($J$6=M11,$K$6,IF($J$7=M11,$K$7,\"?\"))))))","v":"The Three-O Trio"},5,"12:00"]
[3,1,"vs.",3,"South End Heat","vs.","Hawks",7,"11:00",null,null,null,null,null,null,null,null,null,"Game","Championship Game",null,null,"Court","Time"]
[4,2,"vs.",4,"The Jacks","vs.","Shooting Stars",8,"11:00",null,null,null,null,null,null,null,null,null,14,"Winner Game 12","vs.","Winner Game 13",4,"3:00"]
[5,1,"vs.",4,"South End Heat","vs.","Shooting Stars",7,"12:00"]
[6,2,"vs.",3,"The Jacks","vs.","Hawks",6,"12:00"]

{"sheet":"5th_6th_Boys","index":2,"n_rows":20,"n_cols":33,"rows_kept":20,"cut":false,"hidden":false,"merged":[[2,24,2,26],[0,0,0,8],[0,9,0,17],[0,18,0,26],[0,27,0,32],[1,0,1,8],[1,9,1,17],[1,18,1,26],[1,27,1,32],[2,1,2,5],[2,6,2,8],[2,10,2,14],[2,15,2,17],[2,19,2,23],[5,24,5,26],[3,28,3,30],[4,1,4,5],[4,6,4,8],[4,10,4,14],[4,15,4,17],[4,19,4,23],[4,24,4,26],[3,1,3,5],[3,6,3,8],[3,10,3,14],[3,15,3,17],[3,19,3,23],[3,24,3,26],[5,1,5,5],[5,6,5,8],[5,10,5,14],[5,15,5,17],[5,19,5,23],[9,4,9,6],[6,1,6,5],[6,6,6,8],[6,10,6,14],[6,15,6,17],[6,28,6,30],[7,1,7,5],[7,6,7,8],[8,13,8,15],[8,22,8,24],[6,19,6,23],[6,24,6,26]]}
["5th 6th Grade Boys",null,null,null,null,null,null,null,null,{"$f":"A1","v":"5th 6th Grade Boys"},null,null,null,null,null,null,null,null,{"$f":"J1","v":"5th 6th Grade Boys"},null,null,null,null,null,null,null,null,{"$f":"S1","v":"5th 6th Grade Boys"}]
["Pool A",null,null,null,null,null,null,null,null,"Pool B",null,null,null,null,null,null,null,null,"Pool C",null,null,null,null,null,null,null,null,"Playoffs"]
["Team","Name",null,null,null,null,"Contact",null,null,"Team","Name",null,null,null,null,"Contact",null,null,"Team","Name",null,null,null,null,"Contact"]
[1,"SWISH",null,null,null,null,"Chris Henagin",null,null,1,"Cloquet Lumberjacks",null,null,null,null,"Travis Hansen",null,null,1,"Final Four",null,null,null,null,"Mike Phillips",null,null,"Game","Semi-Final Game",null,null,"Court","Time"]
[2,"Golden Chickens",null,null,null,null,"Jonathan Asp",null,null,2,"Grumpy CATZ",null,null,null,null,"Shawn St Germaine",null,null,2,"Esko",null,null,null,null,"Stacey Lillo",null,null,23,"#2 Seeded Pool Winner","vs.","#3 Seeded Pool Winner",2,"2:30"]
[3,"Wolves 2",null,null,null,null,"Amy Calore",null,null,3,"Wolves 1",null,null,null,null,"Amy Calore",null,null,3,"Bucks",null,null,null,null,"Amy Eliason"]
[4,"Travelers",null,null,null,null,"Drew Ahlborg",null,null,4,"basket junkies",null,null,null,null,"Jesse Covill",null,null,4,"Rails",null,null,null,null,"Jesaias Jankowski",null,null,"Game","Championship Game",null,null,"Court","Time"]
[5,"Cooper",null,null,null,null,"Heather Christianson",null,null,null,null,null,null,null,null,null,null,null,null,null,null,null,null,null,null,null,null,24,"#1 Seeded Pool Winner","vs.","Winner of Game 23",2,"3:30"]
[null,null,null,null,null,null,null,null,null,"Game",null,null,null,"Teams",null,null,"Court","Time","Game",null,null,null,"Teams",null,null,"Court","Time"]
["Game",null,null,null,"Teams",null,null,"Court","Time",11,1,"vs.",2,{"$f":"CONCATENATE((IF($J$4=K10,$K$4,IF($J$5=K10,$K$5,IF($J$6=K10,$K$6,IF($J$7=K10,$K$7,\"?\"))))))","v":"Cloquet Lumberjacks"},"vs.",{"$f":"CONCATENATE((IF($J$4=M10,$K$4,IF($J$5=M10,$K$5,IF($J$6=M10,$K$6,IF($J$7=M10,$K$7,\"?\"))))))","v":"Grumpy CATZ"},3,"9:30",17,1,"vs.",2,{"$f":"CONCATENATE((IF($S$4=T10,$T$4,IF($S$5=T10,$T$5,IF($S$6=T10,$T$6,IF($S$7=T10,$T$7,\"?\"))))))","v":"Final Four"},"vs.",{"$f":"CONCATENATE((IF($S$4=V10,$T$4,IF($S$5=V10,$T$5,IF($S$6=V10,$T$6,IF($S$7=V10,$T$7,\"?\"))))))","v":"Esko"},5,"9:30"]
[1,1,"vs.",4,{"$f":"CONCATENATE((IF($A$4=B11,$B$4,IF($A$5=B11,$B$5,IF($A$6=B11,$B$6,IF($A$7=B11,$B$7,IF($A$8=B11,$B$8)))))))","v":"SWISH"},"vs.",{"$f":"CONCATENATE((IF($A$4=D11,$B$4,IF($A$5=D11,$B$5,IF($A$6=D11,$B$6,IF($A$7=D11,$B$7,IF($A$8=D11,$B$8)))))))","v":"Travelers"},1,"9:30",12,3,"vs.",4,{"$f":"CONCATENATE((IF($J$4=K11,$K$4,IF($J$5=K11,$K$5,IF($J$6=K11,$K$6,IF($J$7=K11,$K$7,\"?\"))))))","v":"Wolves 1"},"vs.",{"$f":"CONCATENATE((IF($J$4=M11,$K$4,IF($J$5=M11,$K$5,IF($J$6=M11,$K$6,IF($J$7=M11,$K$7,\"?\"))))))","v":"basket junkies"},4,"9:30",18,3,"vs.",4,{"$f":"CONCATENATE((IF($S$4=T11,$T$4,IF($S$5=T11,$T$5,IF($S$6=T11,$T$6,IF($S$7=T11,$T$7,\"?\"))))))","v":"Bucks"},"vs.",{"$f":"CONCATENATE((IF($S$4=V11,$T$4,IF($S$5=V11,$T$5,IF($S$6=V11,$T$6,IF($S$7=V11,$T$7,\"?\"))))))","v":"Rails"},6,"9:30"]
[2,2,"vs.",3,{"$f":"CONCATENATE((IF($A$4=B12,$B$4,IF($A$5=B12,$B$5,IF($A$6=B12,$B$6,IF($A$7=B12,$B$7,IF($A$8=B12,$B$8)))))))","v":"Golden Chickens"},"vs.",{"$f":"CONCATENATE((IF($A$4=D12,$B$4,IF($A$5=D12,$B$5,IF($A$6=D12,$B$6,IF($A$7=D12,$B$7,IF($A$8=D12,$B$8)))))))","v":"Wolves 2"},2,"9:30",13,1,"vs.",3,"Cloquet Lumberjacks","vs.","Wolves 1",10,"10:30",19,1,"vs.",3,"Final Four","vs.","Bucks",8,"10:30"]
[3,1,"vs.",3,"SWISH","vs.","Wolves 2",12,"10:30",14,2,"vs.",4,"Grumpy CATZ","vs.","basket junkies",9,"10:30",20,2,"vs.",4,"Esko","vs.","Rails",7,"10:30"]
[4,4,"vs.",5,"Travelers","vs.","Cooper",11,"10:30",15,1,"vs.",4,"Cloquet Lumberjacks","vs.","basket junkies",4,"11:30",21,1,"vs.",4,"Final Four","vs.","Rails",2,"11:30"]
[5,3,"vs.",5,"Wolves 2","vs.","Cooper",6,"11:30",16,2,"vs.",3,"Grumpy CATZ","vs.","Wolves 1",3,"11:30",22,2,"vs.",3,"Esko","vs.","Bucks",1,"11:30"]
[6,1,"vs.",2,"SWISH","vs.","Golden Chickens",5,"11:30"]
[7,2,"vs.",5,"Golden Chickens","vs.","Cooper",1,"12:30"]
[8,3,"vs.",4,"Wolves 2","vs.","Travelers",2,"12:30"]
[9,2,"vs.",4,"Golden Chickens","vs.","Travelers",5,"1:30"]
[10,1,"vs.",5,"SWISH","vs.","Cooper",6,"1:30"]

{"sheet":"5th_6th_Girls","index":3,"n_rows":12,"n_cols":24,"rows_kept":12,"cut":false,"hidden":false,"merged":[[0,18,0,23],[1,0,1,8],[1,9,1,17],[1,18,1,23],[4,1,4,5],[4,6,4,8],[4,10,4,14],[4,15,4,17],[0,0,0,8],[0,9,0,17],[2,19,2,21],[3,1,3,5],[3,6,3,8],[3,10,3,14],[3,15,3,17],[6,19,6,21],[8,4,8,6],[10,19,10,21],[5,1,5,5],[5,6,5,8],[5,10,5,14],[5,15,5,17],[6,1,6,5],[6,6,6,8],[6,10,6,14],[6,15,6,17]]}
["5th 6th Grade Girls",null,null,null,null,null,null,null,null,{"$f":"A1","v":"5th 6th Grade Girls"},null,null,null,null,null,null,null,null,{"$f":"J1","v":"5th 6th Grade Girls"}]
["Pool A",null,null,null,null,null,null,null,null,"Pool B",null,null,null,null,null,null,null,null,"Playoffs"]
[null,null,null,null,null,null,null,null,null,null,null,null,null,null,null,null,null,null,"Game","Play-in Games",null,null,"Court","Time"]
["Team","Name",null,null,null,null,"Contact",null,null,"Team","Name",null,null,null,null,"Contact",null,null,7,"Pool A #2 Seed","vs.","Pool B #3 Seed",3,"1:00"]
[1,"Blue Thunder",null,null,null,null,"Sarah Wells",null,null,1,"Rice Lake Warriors",null,null,null,null,"Ryan Doebereiner",null,null,8,"Pool B #2 Seed","vs.","Pool A #3 Seed",4,"1:00"]
[2,"South Ridge",null,null,null,null,"Iah Jankowski",null,null,2,"Spicy Girls",null,null,null,null,"Amy Marline"]
[3,"RC Girlz",null,null,null,null,"Gary Defoe",null,null,3,"Net Rippers",null,null,null,null,"John Johnson",null,null,"Game","Semi-Final Games",null,null,"Court","Time"]
[null,null,null,null,null,null,null,null,null,null,null,null,null,null,null,null,null,null,9,"Winner Game 7","vs.","Pool A #1 Seed",3,"2:00"]
["Game",null,null,null,"Teams",null,null,"Court","Time","Game",null,null,null,"Teams",null,null,"Court","Time",10,"Winner Game 8","vs.","Pool B #1 Seed",4,"2:00"]
[1,1,"vs.",2,{"$f":"CONCATENATE((IF($A$5=B10,$B$5,IF($A$6=B10,$B$6,IF($A$7=B10,$B$7,IF($J$5=B10,$K$5,IF($J$6=B10,$K$6)))))))","v":"Blue Thunder"},"vs.",{"$f":"CONCATENATE((IF($A$5=D10,$B$5,IF($A$6=D10,$B$6,IF($A$7=D10,$B$7,IF($J$5=D10,$K$5,IF($J$6=D10,$K$6)))))))","v":"South Ridge"},8,"10:00",4,1,"vs.",2,{"$f":"CONCATENATE((IF($J$5=K10,$K$5,IF($J$6=K10,$K$6,IF($J$7=K10,$K$7)))))","v":"Rice Lake Warriors"},"vs.",{"$f":"CONCATENATE((IF($J$5=M10,$K$5,IF($J$6=M10,$K$6,IF($J$7=M10,$K$7)))))","v":"Spicy Girls"},9,"10:00"]
[2,1,"vs.",3,{"$f":"CONCATENATE((IF($A$5=B11,$B$5,IF($A$6=B11,$B$6,IF($A$7=B11,$B$7,IF($J$5=B11,$K$5,IF($J$6=B11,$K$6)))))))","v":"Blue Thunder"},"vs.",{"$f":"CONCATENATE((IF($A$5=D11,$B$5,IF($A$6=D11,$B$6,IF($A$7=D11,$B$7,IF($J$5=D11,$K$5,IF($J$6=D11,$K$6)))))))","v":"RC Girlz"},4,"11:00",5,1,"vs.",3,{"$f":"CONCATENATE((IF($J$5=K11,$K$5,IF($J$6=K11,$K$6,IF($J$7=K11,$K$7)))))","v":"Rice Lake Warriors"},"vs.",{"$f":"CONCATENATE((IF($J$5=M11,$K$5,IF($J$6=M11,$K$6,IF($J$7=M11,$K$7)))))","v":"Net Rippers"},5,"11:00","Game","Championship Game",null,null,"Court","Time"]
[3,2,"vs.",3,{"$f":"CONCATENATE((IF($A$5=B12,$B$5,IF($A$6=B12,$B$6,IF($A$7=B12,$B$7,IF($J$5=B12,$K$5,IF($J$6=B12,$K$6)))))))","v":"South Ridge"},"vs.",{"$f":"CONCATENATE((IF($A$5=D12,$B$5,IF($A$6=D12,$B$6,IF($A$7=D12,$B$7,IF($J$5=D12,$K$5,IF($J$6=D12,$K$6)))))))","v":"RC Girlz"},8,"12:00",6,2,"vs.",3,{"$f":"CONCATENATE((IF($J$5=K12,$K$5,IF($J$6=K12,$K$6,IF($J$7=K12,$K$7)))))","v":"Spicy Girls"},"vs.",{"$f":"CONCATENATE((IF($J$5=M12,$K$5,IF($J$6=M12,$K$6,IF($J$7=M12,$K$7)))))","v":"Net Rippers"},9,"12:00",11,"Winner Game 9","vs.","Winner Game 10",2,"3:00"]

{"sheet":"7th_8th_Boys","index":4,"n_rows":20,"n_cols":33,"rows_kept":20,"cut":false,"hidden":false,"merged":[[2,24,2,26],[0,0,0,8],[0,9,0,17],[0,18,0,26],[0,27,0,32],[1,0,1,8],[1,9,1,17],[1,18,1,26],[1,27,1,32],[2,1,2,5],[2,6,2,8],[2,10,2,14],[2,15,2,17],[2,19,2,23],[4,24,4,26],[3,1,3,5],[3,6,3,8],[3,10,3,14],[3,15,3,17],[3,19,3,23],[3,24,3,26],[4,1,4,5],[4,6,4,8],[4,10,4,14],[4,15,4,17],[4,19,4,23],[6,24,6,26],[5,1,5,5],[5,6,5,8],[5,10,5,14],[5,15,5,17],[5,19,5,23],[5,24,5,26],[6,1,6,5],[6,6,6,8],[6,10,6,14],[6,15,6,17],[6,19,6,23],[7,15,7,17],[7,19,7,23],[9,4,9,6],[9,13,9,15],[9,22,9,24],[42,0,42,3],[81,0,81,3],[7,1,7,5],[7,6,7,8],[7,10,7,14]]}
["7th 8th Grade Boys",null,null,null,null,null,null,null,null,{"$f":"A1","v":"7th 8th Grade Boys"},null,null,null,null,null,null,null,null,{"$f":"A1","v":"7th 8th Grade Boys"},null,null,null,null,null,null,null,null,{"$f":"A1","v":"7th 8th Grade Boys"}]
["Pool A",null,null,null,null,null,null,null,null,"Pool B",null,null,null,null,null,null,null,null,"Pool C",null,null,null,null,null,null,null,null,"Playoff"]
["Team","Name",null,null,null,null,"Contact",null,null,"Team","Name",null,null,null,null,"Contact",null,null,"Team","Name",null,null,null,null,"Contact",null,null,"Game",null,null,null,"Court","Time"]
[1,"Mamma's Boyz",null,null,null,null,"Seth Rothamel",null,null,1,"Fab 5",null,null,null,null,"Trish Nelson",null,null,1,"Superior Blue",null,null,null,null,"Sam Meller",null,null,27,"#2 Seed Pool Winner","vs.","#3 Seed Pool Winner",5,"2:30"]
[2,"Spartan Blue",null,null,null,null,"Patrick Semborski",null,null,2,"The Wolves",null,null,null,null,"Gavin Williams",null,null,2,"Dunkin' Dudes",null,null,null,null,"Trent Bagne"]
[3,"TKJ",null,null,null,null,"Jodi Johnson",null,null,3,"TAG",null,null,null,null,"Richard Trautline",null,null,3,"Drummond Hoopers",null,null,null,null,"Alex Rasmussen",null,null,"Game",null,null,null,"Court","Time"]
[4,"Unstoppables",null,null,null,null,"James McKay",null,null,4,"All Stars",null,null,null,null,"Vince Lia",null,null,4,"BBB",null,null,null,null,"Carter Lambert",null,null,28,"Winner Game 27","vs.","#1 Seed Pool Winner",5,"3:30"]
[5,"Red Cliff",null,null,null,null,"Troy Gordon",null,null,5,"Pi-Pie",null,null,null,null,"Michael Childs"]
[]
["Game",null,null,null,"Teams",null,null,"Court","Time","Game",null,null,null,"Teams",null,null,"Court","Time","Game",null,null,null,"Teams",null,null,"Court","Time"]
[1,1,"vs.",4,{"$f":"CONCATENATE((IF($A$4=B11,$B$4,IF($A$5=B11,$B$5,IF($A$6=B11,$B$6,IF($A$7=B11,$B$7,IF($A$8=B11,$B$8)))))))","v":"Mamma's Boyz"},"vs.",{"$f":"CONCATENATE((IF($A$4=D11,$B$4,IF($A$5=D11,$B$5,IF($A$6=D11,$B$6,IF($A$7=D11,$B$7,IF($A$8=D11,$B$8)))))))","v":"Unstoppables"},12,"9:30",11,1,"vs.",4,{"$f":"CONCATENATE((IF($J$4=K11,$K$4,IF($J$5=K11,$K$5,IF($J$6=K11,$K$6,IF($J$7=K11,$K$7,IF($J$8=K11,$K$8)))))))","v":"Fab 5"},"vs.",{"$f":"CONCATENATE((IF($J$4=M11,$K$4,IF($J$5=M11,$K$5,IF($J$6=M11,$K$6,IF($J$7=M11,$K$7,IF($J$8=M11,$K$8)))))))","v":"All Stars"},10,"9:30",21,1,"vs.",2,{"$f":"CONCATENATE((IF($S$4=T11,$T$4,IF($S$5=T11,$T$5,IF($S$6=T11,$T$6,IF($S$7=T11,$T$7,IF($S$8=T11,$T$8)))))))","v":"Superior Blue"},"vs.",{"$f":"CONCATENATE((IF($S$4=V11,$T$4,IF($S$5=V11,$T$5,IF($S$6=V11,$T$6,IF($S$7=V11,$T$7,IF($S$8=V11,$T$8)))))))","v":"Dunkin' Dudes"},8,"9:30"]
[2,2,"vs.",3,"Spartan Blue","vs.","TKJ",11,"9:30",12,2,"vs.",3,{"$f":"CONCATENATE((IF($J$4=K12,$K$4,IF($J$5=K12,$K$5,IF($J$6=K12,$K$6,IF($J$7=K12,$K$7,IF($J$8=K12,$K$8)))))))","v":"The Wolves"},"vs.",{"$f":"CONCATENATE((IF($J$4=M12,$K$4,IF($J$5=M12,$K$5,IF($J$6=M12,$K$6,IF($J$7=M12,$K$7,IF($J$8=M12,$K$8)))))))","v":"TAG"},9,"9:30",22,3,"vs.",4,{"$f":"CONCATENATE((IF($S$4=T12,$T$4,IF($S$5=T12,$T$5,IF($S$6=T12,$T$6,IF($S$7=T12,$T$7,IF($S$8=T12,$T$8)))))))","v":"Drummond Hoopers"},"vs.",{"$f":"CONCATENATE((IF($S$4=V12,$T$4,IF($S$5=V12,$T$5,IF($S$6=V12,$T$6,IF($S$7=V12,$T$7,IF($S$8=V12,$T$8)))))))","v":"BBB"},7,"9:30"]
[3,1,"vs.",3,"Mamma's Boyz","vs.","TKJ",1,"10:30",13,1,"vs.",3,"Fab 5","vs.","TAG",3,"10:30",23,1,"vs.",3,"Superior Blue","vs.","Drummond Hoopers",5,"10:30"]
[4,4,"vs.",5,"Unstoppables","vs.","Red Cliff",2,"10:30",14,4,"vs.",5,"All Stars","vs.","Pi-Pie",4,"10:30",24,2,"vs.",4,"Dunkin' Dudes","vs.","BBB",6,"10:30"]
[5,3,"vs.",5,"TKJ","vs.","Red Cliff",7,"11:30",15,3,"vs.",5,"TAG","vs.","Pi-Pie",9,"11:30",25,1,"vs.",4,"Superior Blue","vs.","BBB",11,"11:30"]
[6,1,"vs.",2,"Mamma's Boyz","vs.","Spartan Blue",8,"11:30",16,1,"vs.",2,"Fab 5","vs.","The Wolves",10,"11:30",26,2,"vs.",3,"Dunkin' Dudes","vs.","Drummond Hoopers",12,"11:30"]
[7,2,"vs.",5,"Spartan Blue","vs.","Red Cliff",3,"12:30",17,2,"vs.",5,"The Wolves","vs.","Pi-Pie",5,"12:30"]
[8,3,"vs.",4,"TKJ","vs.","Unstoppables",4,"12:30",18,3,"vs.",4,"TAG","vs.","All Stars",6,"12:30"]
[9,2,"vs.",4,"Spartan Blue","vs.","Unstoppables",3,"1:30",19,2,"vs.",4,"The Wolves","vs.","All Stars",1,"1:30"]
[10,1,"vs.",5,"Mamma's Boyz","vs.","Red Cliff",4,"1:30",20,1,"vs.",5,"Fab 5","vs.","Pi-Pie",2,"1:30"]

{"sheet":"7th_8th_Girls","index":5,"n_rows":15,"n_cols":24,"rows_kept":15,"cut":false,"hidden":false,"merged":[[0,0,0,8],[0,9,0,17],[0,18,0,23],[1,0,1,8],[1,9,1,17],[1,18,1,23],[2,1,2,5],[2,6,2,8],[2,10,2,14],[2,15,2,17],[3,1,3,5],[3,6,3,8],[3,10,3,14],[3,15,3,17],[11,19,11,21],[3,19,3,21],[4,1,4,5],[4,6,4,8],[4,10,4,14],[4,15,4,17],[5,1,5,5],[5,6,5,8],[5,10,5,14],[5,15,5,17],[6,1,6,5],[6,6,6,8],[7,13,7,15],[7,19,7,21],[8,4,8,6]]}
["7th 8th Grade Girls",null,null,null,null,null,null,null,null,{"$f":"A1","v":"7th 8th Grade Girls"},null,null,null,null,null,null,null,null,{"$f":"J1","v":"7th 8th Grade Girls"}]
["Pool A",null,null,null,null,null,null,null,null,"Pool B",null,null,null,null,null,null,null,null,"Playoffs"]
["Team","Name",null,null,null,null,"Contact",null,null,"Team","Name",null,null,null,null,"Contact"]
[1,"Lady Warriors",null,null,null,null,"Sam Mason",null,null,1,"Superior Hotshots",null,null,null,null,"Lauren Gunderson",null,null,"Game","Play-in Games",null,null,"Court","Time"]
[2,"Schrute Farms",null,null,null,null,"Marcus Pocernich",null,null,2,"Hoop Breakers",null,null,null,null,"Justin Olesiak",null,null,10,"Pool A #2 Seed","vs.","Pool B #3 Seed",5,"1:00"]
[3,"Tallz n Smallz",null,null,null,null,"Tieryn Plasch",null,null,3,"Tigers",null,null,null,null,"Annalee Sutherland",null,null,11,"Pool B #2 Seed","vs.","Pool A #3 Seed",6,"1:00"]
[4,"TigerBallers",null,null,null,null,"Richard Trautline"]
[null,null,null,null,null,null,null,null,null,"Game",null,null,null,"Teams",null,null,"Court","Time","Game","Semi-Final Games",null,null,"Court","Time"]
["Game",null,null,null,"Teams",null,null,"Court","Time",7,1,"vs.",2,{"$f":"CONCATENATE((IF($J$4=K9,$K$4,IF($J$5=K9,$K$5,IF($J$6=K9,$K$6,IF($J$7=K9,$K$7,\"?\"))))))","v":"Superior Hotshots"},"vs.",{"$f":"CONCATENATE((IF($J$4=M9,$K$4,IF($J$5=M9,$K$5,IF($J$6=M9,$K$6,IF($J$7=M9,$K$7,\"?\"))))))","v":"Hoop Breakers"},12,"10:00",12,"Winner Game 10","vs.","Pool A #1 Seed",5,"2:00"]
[1,1,"vs.",2,{"$f":"CONCATENATE((IF($A$4=B10,$B$4,IF($A$5=B10,$B$5,IF($A$6=B10,$B$6,IF($A$7=B10,$B$7,\"?\"))))))","v":"Lady Warriors"},"vs.",{"$f":"CONCATENATE((IF($A$4=D10,$B$4,IF($A$5=D10,$B$5,IF($A$6=D10,$B$6,IF($A$7=D10,$B$7,\"?\"))))))","v":"Schrute Farms"},10,"10:00",8,2,"vs.",3,{"$f":"CONCATENATE((IF($J$4=K10,$K$4,IF($J$5=K10,$K$5,IF($J$6=K10,$K$6,IF($J$7=K10,$K$7,\"?\"))))))","v":"Hoop Breakers"},"vs.",{"$f":"CONCATENATE((IF($J$4=M10,$K$4,IF($J$5=M10,$K$5,IF($J$6=M10,$K$6,IF($J$7=M10,$K$7,\"?\"))))))","v":"Tigers"},2,"11:00",13,"Winner Game 11","vs.","Pool B #1 Seed",6,"2:00"]
[2,3,"vs.",4,{"$f":"CONCATENATE((IF($A$4=B11,$B$4,IF($A$5=B11,$B$5,IF($A$6=B11,$B$6,IF($A$7=B11,$B$7,\"?\"))))))","v":"Tallz n Smallz"},"vs.","TigerBallers",11,"10:00",9,1,"vs.",3,{"$f":"CONCATENATE((IF($J$4=K11,$K$4,IF($J$5=K11,$K$5,IF($J$6=K11,$K$6,IF($J$7=K11,$K$7,\"?\"))))))","v":"Superior Hotshots"},"vs.",{"$f":"CONCATENATE((IF($J$4=M11,$K$4,IF($J$5=M11,$K$5,IF($J$6=M11,$K$6,IF($J$7=M11,$K$7,\"?\"))))))","v":"Tigers"},12,"12:00"]
[3,1,"vs.",3,"Lady Warriors","vs.","Tallz n Smallz",1,"11:00",null,null,null,null,null,null,null,null,null,"Game","Championship Game",null,null,"Court","Time"]
[4,2,"vs.",4,"Schrute Farms","vs.","TigerBallers",3,"11:00",null,null,null,null,null,null,null,null,null,14,"Winner Game 12","vs.","Winner Game 13",5,"3:00"]
[5,1,"vs.",4,"Lady Warriors","vs.","TigerBallers",10,"12:00"]
[6,2,"vs.",3,"Schrute Farms","vs.","Tallz n Smallz",11,"12:00"]

{"sheet":"Saturday Games","index":6,"n_rows":58,"n_cols":15,"rows_kept":58,"cut":false,"hidden":false,"merged":[[39,0,41,0],[0,1,0,6],[48,0,50,0],[51,0,53,0],[6,0,8,0],[1,1,1,6],[3,0,5,0],[54,0,56,0],[57,0,59,0],[0,7,0,14],[1,7,1,14],[45,0,47,0],[9,0,11,0],[12,0,14,0],[15,0,17,0],[18,0,20,0],[21,0,23,0],[42,0,44,0],[24,0,26,0],[27,0,29,0],[30,0,32,0],[33,0,35,0],[36,0,38,0]]}
[null,"Saturday Games",null,null,null,null,null,"Saturday Games"]
[null,"Gym",null,null,null,null,null,"Fieldhouse"]
[null,1,2,3,4,5,6,7,8,9,10,11,12,13,14]
["9:30","5th 6th Boys Pool A","5th 6th Boys Pool A","5th 6th Boys Pool B","5th 6th Boys Pool B","5th 6th Boys Pool C","5th 6th Boys Pool C","7th 8th Boys Pool C","7th 8th Boys Pool C","7th 8th Boys Pool B","7th 8th Boys Pool B","7th 8th Boys Pool A","7th 8th Boys Pool A"]
[null,"SWISH vs.","Golden Chickens vs.","Cloquet Lumberjacks vs.","Wolves 1 vs.","Final Four vs.","Bucks vs.","Drummond Hoopers vs.","Superior Blue vs.","The Wolves vs.","Fab 5 vs.","Spartan Blue vs.","Mamma's Boyz vs."]
[null,"Travelers","Wolves 2","Grumpy CATZ","basket junkies","Esko","Rails","BBB","Dunkin' Dudes","TAG","All Stars","TKJ","Unstoppables"]
["10:00","3rd 4th Boys Pool A","3rd 4th Boys Pool A","3rd 4th Boys Pool B","3rd 4th Boys Pool B","3rd 4th Girls Pool A","3rd 4th Girls Pool A","3rd 4th Girls Pool B","5th 6th Girls Pool A","5th 6th Girls Pool B","7th 8th Girls Pool A","7th 8th Girls Pool A","7th 8th Girls Pool B"]
[null,"Freak Squad vs.","Hunters vs.","Cardinals vs.","Alley-Opps vs.","South End Heat vs.","Hawks vs.","Ballers, Shot Callers vs.","Blue Thunder vs.","Rice Lake Warriors vs.","Lady Warriors vs.","Tallz n Smallz vs.","Superior Hotshots vs."]
[null,"The Jacks","Drummond","Sneaky Ballerz","The Dominators","The Jacks","Shooting Stars","Baskethounds","South Ridge","Spicy Girls","Schrute Farms","TigerBallers","Hoop Breakers"]
["10:30","7th 8th Boys Pool A","7th 8th Boys Pool A","7th 8th Boys Pool B","7th 8th Boys Pool B","7th 8th Boys Pool C","7th 8th Boys Pool C","5th 6th Boys Pool C","5th 6th Boys Pool C","5th 6th Boys Pool B","5th 6th Boys Pool B","5th 6th Boys Pool A","5th 6th Boys Pool A"]
[null,"Mamma's Boyz vs.","Unstoppables vs.","Fab 5 vs.","All Stars vs.","Superior Blue vs.","Dunkin' Dudes vs.","Esko vs.","Final Four vs.","Grumpy CATZ vs.","Cloquet Lumberjacks vs.","Travelers vs.","SWISH vs."]
[null,"TKJ","Red Cliff","TAG","Pi-Pie","Drummond Hoopers","BBB","Rails","Bucks","basket junkies","Wolves 1","Cooper","Wolves 2"]
["11:00","7th 8th Girls Pool A","7th 8th Girls Pool B","7th 8th Girls Pool A","5th 6th Girls Pool A","5th 6th Girls Pool B","3rd 4th Girls Pool B","3rd 4th Girls Pool A","3rd 4th Girls Pool A","3rd 4th Boys Pool A","3rd 4th Boys Pool A","3rd 4th Boys Pool B","3rd 4th Boys Pool B"]
[null,"Lady Warriors vs.","Hoop Breakers vs.","Schrute Farms vs.","Blue Thunder vs.","Rice Lake Warriors vs.","Baskethounds vs.","South End Heat vs.","The Jacks vs.","Freak Squad vs.","The Jacks vs.","Cardinals vs.","Sneaky Ballerz vs."]
[null,"Tallz n Smallz","Tigers","TigerBallers","RC Girlz","Net Rippers","The Three-O Trio","Hawks","Shooting Stars","Drummond","South Ridge","Alley-Opps","The Dominators"]
["11:30","5th 6th Boys Pool C","5th 6th Boys Pool C","5th 6th Boys Pool B","5th 6th Boys Pool B","5th 6th Boys Pool A","5th 6th Boys Pool A","7th 8th Boys Pool A","7th 8th Boys Pool A","7th 8th Boys Pool B","7th 8th Boys Pool B","7th 8th Boys Pool C","7th 8th Boys Pool C"]
[null,"Esko vs.","Final Four vs.","Grumpy CATZ vs.","Cloquet Lumberjacks vs.","SWISH vs.","Wolves 2 vs.","TKJ vs.","Mamma's Boyz vs.","TAG vs.","Fab 5 vs.","Superior Blue vs.","Dunkin' Dudes vs."]
[null,"Bucks","Rails","Wolves 1","basket junkies","Golden Chickens","Cooper","Red Cliff","Spartan Blue","Pi-Pie","The Wolves","BBB","Drummond Hoopers"]
["12:00","3rd 4th Boys Pool A","3rd 4th Boys Pool A","3rd 4th Boys Pool B","3rd 4th Boys Pool B","3rd 4th Girls Pool B","3rd 4th Girls Pool A","3rd 4th Girls Pool A","5th 6th Girls Pool A","5th 6th Girls Pool B","7th 8th Girls Pool A","7th 8th Girls Pool A","7th 8th Girls Pool B"]
[null,"Drummond vs.","Freak Squad vs.","Cardinals vs.","Sneaky Ballerz vs.","Ballers, Shot Callers vs.","The Jacks vs.","South End Heat vs.","South Ridge vs.","Spicy Girls vs.","Lady Warriors vs.","Schrute Farms vs.","Superior Hotshots vs."]
[null,"South Ridge","Hunters","The Dominators","Alley-Opps","The Three-O Trio","Hawks","Shooting Stars","RC Girlz","Net Rippers","TigerBallers","Tallz n Smallz","Tigers"]
["12:30","5th 6th Boys Pool A","5th 6th Boys Pool A","7th 8th Boys Pool A","7th 8th Boys Pool A","7th 8th Boys Pool B","7th 8th Boys Pool B"]
[null,"Golden Chickens vs.","Wolves 2 vs.","Spartan Blue vs.","TKJ vs.","The Wolves vs.","TAG vs."]
[null,"Cooper","Travelers","Red Cliff","Unstoppables","Pi-Pie","All Stars"]
["1:00","3rd 4th Girls Playoffs","3rd 4th Girls Playoffs","5th 6th Girls Playoffs","5th 6th Girls Playoffs","7th 8th Girls Playoffs","7th 8th Girls Playoffs","3rd 4th Boys Pool A","3rd 4th Boys Pool A"]
[null,"Pool A #2 Seed vs.","Pool B #2 Seed vs.","Pool A #2 Seed vs.","Pool B #2 Seed vs.","Pool A #2 Seed vs.","Pool B #2 Seed vs.","Hunters vs.","Drummond vs."]
[null,"Pool B #3 Seed","Pool A #3 Seed","Pool B #3 Seed","Pool A #3 Seed","Pool B #3 Seed","Pool A #3 Seed","South Ridge","The Jacks"]
["1:30","7th 8th Boys Pool B","7th 8th Boys Pool B","7th 8th Boys Pool A","7th 8th Boys Pool A","5th 6th Boys Pool A","5th 6th Boys Pool A"]
[null,"The Wolves vs.","Fab 5 vs.","Spartan Blue vs.","Mamma's Boyz vs.","Golden Chickens vs.","SWISH vs."]
[null,"All Stars","Pi-Pie","Unstoppables","Red Cliff","Travelers","Cooper"]
["2:00","3rd 4th Girls Playoffs","3rd 4th Girls Playoffs","5th 6th Girls Playoffs","5th 6th Girls Playoffs","7th 8th Girls Playoffs","7th 8th Girls Playoffs","3rd 4th Boys Pool A","3rd 4th Boys Pool A"]
[null,"Winner Game 10 vs.","Winner Game 11 vs.","Winner Game 7 vs.","Winner Game 8 vs.","Winner Game 10 vs.","Winner Game 11 vs.","Hunters vs.","Freak Squad vs."]
[null,"Pool A #1 Seed","Pool B #1 Seed","Pool A #1 Seed","Pool B #1 Seed","Pool A #1 Seed","Pool B #1 Seed","The Jacks","South Ridge"]
["2:30",null,"5th 6th Boys Playoffs",null,null,"7th 8th Boys Playoffs"]
[null,null,"#2 Seeded Pool Winner vs.",null,null,"#2 Seed Pool Winner vs."]
[null,null,"#3 Seeded Pool Winner",null,null,"#3 Seed Pool Winner"]
["3:00","3rd 4th Boys Championship","5th 6th Girls Championship",null,"3rd 4th Girls Championship","7th 8th Girls Championship"]
[null,"Pool A #1 Seed vs.","Winner Game 9 vs.",null,"Winner Game 12 vs.","Winner Game 12 vs."]
[null,"Pool B #1 Seed","Winner Game 10",null,"Winner Game 13","Winner Game 13"]
["3:30",null,"5th 6th Boys Championship",null,null,"7th 8th Boys Championship"]
[null,null,"#1 Seeded Pool Winner vs.",null,null,"Winner Game 27 vs."]
[null,null,"Winner of Game 23",null,null,"#1 Seed Pool Winner"]
["4:00"]
[]
[]
["4:30"]
[]
[]
["5:00"]
[]
[]
["5:30"]
[]
[]
["6:00"]
[]
[]
["6:30"]

{"sheet":"Form_Data","index":7,"n_rows":27,"n_cols":1,"rows_kept":27,"cut":false,"hidden":false,"merged":[]}
["Divisions"]
["3rd 4th Boys Pool A"]
["3rd 4th Boys Pool B"]
["3rd 4th Boys Playoffs"]
["3rd 4th Boys Championship"]
["3rd 4th Girls Pool A"]
["3rd 4th Girls Pool B"]
["3rd 4th Girls Playoffs"]
["3rd 4th Girls Championship"]
["5th 6th Girls Pool A"]
["5th 6th Girls Pool B"]
["5th 6th Girls Playoffs"]
["5th 6th Girls Championship"]
["5th 6th Boys Pool A"]
["5th 6th Boys Pool B"]
["5th 6th Boys Pool C"]
["5th 6th Boys Playoffs"]
["5th 6th Boys Championship"]
["7th 8th Girls Pool A"]
["7th 8th Girls Pool B"]
["7th 8th Girls Playoffs"]
["7th 8th Girls Championship"]
["7th 8th Boys Pool A"]
["7th 8th Boys Pool B"]
["7th 8th Boys Pool C"]
["7th 8th Boys Playoffs"]
["7th 8th Boys Championship"]

{"sheet":"3 team","index":8,"n_rows":17,"n_cols":9,"rows_kept":17,"cut":false,"hidden":false,"merged":[[15,4,15,6],[12,4,12,6],[0,0,0,8],[1,0,1,8],[7,4,7,6],[2,6,2,8],[2,1,2,5],[3,1,3,5],[4,1,4,5],[5,1,5,5],[3,6,3,8],[4,6,4,8],[5,6,5,8]]}
["3 Team Bracket"]
[]
["Team","Name",null,null,null,null,"Contact"]
[1,"Pool A1"]
[2,"Pool A2"]
[3,"Pool A3"]
[]
["Game",null,null,null,"Teams",null,null,"Court","Time"]
[1,1,"vs.",2,{"$f":"CONCATENATE((IF($A$4=B9,$B$4,IF($A$5=B9,$B$5,IF($A$6=B9,$B$6,IF($A$7=B9,$B$7,\"?\"))))))","v":"Pool A1"},"vs.",{"$f":"CONCATENATE((IF($A$4=D9,$B$4,IF($A$5=D9,$B$5,IF($A$6=D9,$B$6,IF($A$7=D9,$B$7,\"?\"))))))","v":"Pool A2"}]
[2,2,"vs.",3,{"$f":"CONCATENATE((IF($A$4=B10,$B$4,IF($A$5=B10,$B$5,IF($A$6=B10,$B$6,IF($A$7=B10,$B$7,\"?\"))))))","v":"Pool A2"},"vs.",{"$f":"CONCATENATE((IF($A$4=D10,$B$4,IF($A$5=D10,$B$5,IF($A$6=D10,$B$6,IF($A$7=D10,$B$7,\"?\"))))))","v":"Pool A3"}]
[3,1,"vs.",3,{"$f":"CONCATENATE((IF($A$4=B11,$B$4,IF($A$5=B11,$B$5,IF($A$6=B11,$B$6,IF($A$7=B11,$B$7,\"?\"))))))","v":"Pool A1"},"vs.",{"$f":"CONCATENATE((IF($A$4=D11,$B$4,IF($A$5=D11,$B$5,IF($A$6=D11,$B$6,IF($A$7=D11,$B$7,\"?\"))))))","v":"Pool A3"}]
[]
["Game",null,null,null,"Semi-Final Game",null,null,"Court","Time"]
[4,null,null,null,"#2 Seed","vs.","#3 Seed"]
[]
["Game",null,null,null,"Championship Game",null,null,"Court","Time"]
[5,null,null,null,"#1 Seed","vs.","Winner of Game 4"]

{"sheet":"4 Teams","index":9,"n_rows":15,"n_cols":9,"rows_kept":15,"cut":false,"hidden":false,"merged":[[8,4,8,6],[4,1,4,5],[5,1,5,5],[6,1,6,5],[3,6,3,8],[4,6,4,8],[5,6,5,8],[6,6,6,8],[0,0,0,8],[1,0,1,8],[2,1,2,5],[2,6,2,8],[3,1,3,5]]}
["4 Team Bracket"]
[]
["Team","Name",null,null,null,null,"Contact"]
[1,"Pool A1"]
[2,"Pool A2"]
[3,"Pool A3"]
[4,"Pool A4"]
[]
["Game",null,null,null,"Teams",null,null,"Court","Time"]
[1,1,"vs.",2,{"$f":"CONCATENATE((IF($A$4=B10,$B$4,IF($A$5=B10,$B$5,IF($A$6=B10,$B$6,IF($A$7=B10,$B$7,\"?\"))))))","v":"Pool A1"},"vs.",{"$f":"CONCATENATE((IF($A$4=D10,$B$4,IF($A$5=D10,$B$5,IF($A$6=D10,$B$6,IF($A$7=D10,$B$7,\"?\"))))))","v":"Pool A2"}]
[2,3,"vs.",4,{"$f":"CONCATENATE((IF($A$4=B11,$B$4,IF($A$5=B11,$B$5,IF($A$6=B11,$B$6,IF($A$7=B11,$B$7,\"?\"))))))","v":"Pool A3"},"vs.","Pool A4"]
[3,1,"vs.",3,"Pool A1","vs.","Pool A3"]
[4,2,"vs.",4,"Pool A2","vs.","Pool A4"]
[5,1,"vs.",4,"Pool A1","vs.","Pool A4"]
[6,2,"vs.",3,"Pool A2","vs.","Pool A3"]

{"sheet":"5 team","index":10,"n_rows":20,"n_cols":9,"rows_kept":20,"cut":false,"hidden":false,"merged":[[9,4,9,6],[0,0,0,8],[1,0,1,8],[2,1,2,5],[2,6,2,8],[3,1,3,5],[4,1,4,5],[5,1,5,5],[6,1,6,5],[7,1,7,5],[3,6,3,8],[4,6,4,8],[5,6,5,8],[6,6,6,8],[7,6,7,8]]}
["5 Team Bracket"]
[]
["Team","Name",null,null,null,null,"Contact"]
[1,"Pool A1"]
[2,"Pool A2"]
[3,"Pool A3"]
[4,"Pool A4"]
[5,"Pool A5"]
[]
["Game",null,null,null,"Teams",null,null,"Court","Time"]
[1,1,"vs.",4,{"$f":"CONCATENATE((IF($A$4=B11,$B$4,IF($A$5=B11,$B$5,IF($A$6=B11,$B$6,IF($A$7=B11,$B$7,IF($A$8=B11,$B$8)))))))","v":"Pool A1"},"vs.",{"$f":"CONCATENATE((IF($A$4=D11,$B$4,IF($A$5=D11,$B$5,IF($A$6=D11,$B$6,IF($A$7=D11,$B$7,IF($A$8=D11,$B$8)))))))","v":"Pool A4"}]
[2,2,"vs.",3,{"$f":"CONCATENATE((IF($A$4=B12,$B$4,IF($A$5=B12,$B$5,IF($A$6=B12,$B$6,IF($A$7=B12,$B$7,IF($A$8=B12,$B$8)))))))","v":"Pool A2"},"vs.",{"$f":"CONCATENATE((IF($A$4=D12,$B$4,IF($A$5=D12,$B$5,IF($A$6=D12,$B$6,IF($A$7=D12,$B$7,IF($A$8=D12,$B$8)))))))","v":"Pool A3"}]
[3,1,"vs.",3,"Pool A1","vs.","Pool A3"]
[4,4,"vs.",5,"Pool A4","vs.","Pool A5"]
[5,3,"vs.",5,"Pool A3","vs.","Pool A5"]
[6,1,"vs.",2,"Pool A1","vs.","Pool A2"]
[7,2,"vs.",5,"Pool A2","vs.","Pool A5"]
[8,3,"vs.",4,"Pool A3","vs.","Pool A4"]
[9,2,"vs.",4,"Pool A2","vs.","Pool A4"]
[10,1,"vs.",5,"Pool A1","vs.","Pool A5"]

{"sheet":"6 Team Pool","index":11,"n_rows":12,"n_cols":24,"rows_kept":12,"cut":false,"hidden":false,"merged":[[0,18,0,23],[1,0,1,8],[1,9,1,17],[1,18,1,23],[4,1,4,5],[4,6,4,8],[4,10,4,14],[4,15,4,17],[0,0,0,8],[0,9,0,17],[2,19,2,21],[3,1,3,5],[3,6,3,8],[3,10,3,14],[3,15,3,17],[6,19,6,21],[8,4,8,6],[10,19,10,21],[5,1,5,5],[5,6,5,8],[5,10,5,14],[5,15,5,17],[6,1,6,5],[6,6,6,8],[6,10,6,14],[6,15,6,17]]}
["6 Team Bracket",null,null,null,null,null,null,null,null,{"$f":"A1","v":"6 Team Bracket"},null,null,null,null,null,null,null,null,{"$f":"J1","v":"6 Team Bracket"}]
["Pool A",null,null,null,null,null,null,null,null,"Pool B",null,null,null,null,null,null,null,null,"Playoffs"]
[null,null,null,null,null,null,null,null,null,null,null,null,null,null,null,null,null,null,"Game","Play-in Games",null,null,"Court","Time"]
["Team","Name",null,null,null,null,"Contact",null,null,"Team","Name",null,null,null,null,"Contact",null,null,7,"Pool A #2 Seed","vs.","Pool B #3 Seed"]
[1,"Pool A1",null,null,null,null,null,null,null,1,"Pool B1",null,null,null,null,null,null,null,8,"Pool B #2 Seed","vs.","Pool A #3 Seed"]
[2,"Pool A2",null,null,null,null,null,null,null,2,"Pool B2"]
[3,"Pool A3",null,null,null,null,null,null,null,3,"Pool B3",null,null,null,null,null,null,null,"Game","Semi-Final Games",null,null,"Court","Time"]
[null,null,null,null,null,null,null,null,null,null,null,null,null,null,null,null,null,null,9,"Winner Game 7","vs.","Pool A #1 Seed"]
["Game",null,null,null,"Teams",null,null,"Court","Time","Game",null,null,null,"Teams",null,null,"Court","Time",10,"Winner Game 8","vs.","Pool B #1 Seed"]
[1,1,"vs.",2,{"$f":"CONCATENATE((IF($A$5=B10,$B$5,IF($A$6=B10,$B$6,IF($A$7=B10,$B$7,IF($J$5=B10,$K$5,IF($J$6=B10,$K$6)))))))","v":"Pool A1"},"vs.",{"$f":"CONCATENATE((IF($A$5=D10,$B$5,IF($A$6=D10,$B$6,IF($A$7=D10,$B$7,IF($J$5=D10,$K$5,IF($J$6=D10,$K$6)))))))","v":"Pool A2"},null,null,4,1,"vs.",2,{"$f":"CONCATENATE((IF($J$5=K10,$K$5,IF($J$6=K10,$K$6,IF($J$7=K10,$K$7)))))","v":"Pool B1"},"vs.",{"$f":"CONCATENATE((IF($J$5=M10,$K$5,IF($J$6=M10,$K$6,IF($J$7=M10,$K$7)))))","v":"Pool B2"}]
[2,1,"vs.",3,{"$f":"CONCATENATE((IF($A$5=B11,$B$5,IF($A$6=B11,$B$6,IF($A$7=B11,$B$7,IF($J$5=B11,$K$5,IF($J$6=B11,$K$6)))))))","v":"Pool A1"},"vs.",{"$f":"CONCATENATE((IF($A$5=D11,$B$5,IF($A$6=D11,$B$6,IF($A$7=D11,$B$7,IF($J$5=D11,$K$5,IF($J$6=D11,$K$6)))))))","v":"Pool A3"},null,null,5,1,"vs.",3,{"$f":"CONCATENATE((IF($J$5=K11,$K$5,IF($J$6=K11,$K$6,IF($J$7=K11,$K$7)))))","v":"Pool B1"},"vs.",{"$f":"CONCATENATE((IF($J$5=M11,$K$5,IF($J$6=M11,$K$6,IF($J$7=M11,$K$7)))))","v":"Pool B3"},null,null,"Game","Championship Game",null,null,"Court","Time"]
[3,2,"vs.",3,{"$f":"CONCATENATE((IF($A$5=B12,$B$5,IF($A$6=B12,$B$6,IF($A$7=B12,$B$7,IF($J$5=B12,$K$5,IF($J$6=B12,$K$6)))))))","v":"Pool A2"},"vs.",{"$f":"CONCATENATE((IF($A$5=D12,$B$5,IF($A$6=D12,$B$6,IF($A$7=D12,$B$7,IF($J$5=D12,$K$5,IF($J$6=D12,$K$6)))))))","v":"Pool A3"},null,null,6,2,"vs.",3,{"$f":"CONCATENATE((IF($J$5=K12,$K$5,IF($J$6=K12,$K$6,IF($J$7=K12,$K$7)))))","v":"Pool B2"},"vs.",{"$f":"CONCATENATE((IF($J$5=M12,$K$5,IF($J$6=M12,$K$6,IF($J$7=M12,$K$7)))))","v":"Pool B3"},null,null,11,"Winner Game 9","vs.","Winner Game 10"]

{"sheet":"6 Team Round","index":12,"n_rows":26,"n_cols":9,"rows_kept":26,"cut":false,"hidden":false,"merged":[[0,0,0,8],[1,0,1,8],[2,1,2,5],[2,6,2,8],[3,1,3,5],[3,6,3,8],[4,1,4,5],[4,6,4,8],[5,1,5,5],[5,6,5,8],[6,1,6,5],[6,6,6,8],[7,1,7,5],[7,6,7,8],[10,0,10,3],[10,4,10,6],[8,1,8,5],[8,6,8,8]]}
["6 Team Round Robin"]
[]
["Team","Name",null,null,null,null,"Contact"]
[1,"Pool A1"]
[2,"Pool A2"]
[3,"Pool A3"]
[4,"Pool A4"]
[5,"Pool A5"]
[6,"Pool A6"]
[]
["Game",null,null,null,"Teams",null,null,"Court","Time"]
[1,1,"vs.",6,{"$f":"CONCATENATE((IF($A$4=B12,$B$4,IF($A$5=B12,$B$5,IF($A$6=B12,$B$6,IF($A$7=B12,$B$7,IF($A$8=B12,$B$8,IF($A$9=B12,$B$9))))))))","v":"Pool A1"},"vs.",{"$f":"CONCATENATE((IF($A$4=D12,$B$4,IF($A$5=D12,$B$5,IF($A$6=D12,$B$6,IF($A$7=D12,$B$7,IF($A$8=D12,$B$8,IF($A$9=D12,$B$9))))))))","v":"Pool A6"}]
[2,2,"vs.",5,{"$f":"CONCATENATE((IF($A$4=B13,$B$4,IF($A$5=B13,$B$5,IF($A$6=B13,$B$6,IF($A$7=B13,$B$7,IF($A$8=B13,$B$8)))))))","v":"Pool A2"},"vs.",{"$f":"CONCATENATE((IF($A$4=D13,$B$4,IF($A$5=D13,$B$5,IF($A$6=D13,$B$6,IF($A$7=D13,$B$7,IF($A$8=D13,$B$8,IF($A$9=D13,$B$9))))))))","v":"Pool A5"}]
[3,3,"vs.",4,"Pool A3","vs.","Pool A4"]
[4,1,"vs.",5,"Pool A1","vs.","Pool A5"]
[5,2,"vs.",4,"Pool A2","vs.","Pool A4"]
[6,3,"vs.",6,"Pool A3","vs.","Pool A6"]
[7,1,"vs.",4,"Pool A1","vs.","Pool A4"]
[8,2,"vs.",3,"Pool A2","vs.","Pool A3"]
[9,5,"vs.",6,"Pool A5","vs.","Pool A6"]
[10,1,"vs.",3,"Pool A1","vs.","Pool A3"]
[11,2,"vs.",6,"Pool A2","vs.","Pool A6"]
[12,4,"vs.",5,"Pool A4","vs.","Pool A5"]
[13,1,"vs.",2,"Pool A1","vs.","Pool A2"]
[14,3,"vs.",5,"Pool A3","vs.","Pool A5"]
[15,4,"vs.",6,"Pool A4","vs.","Pool A6"]

{"sheet":"7 team","index":13,"n_rows":15,"n_cols":24,"rows_kept":15,"cut":false,"hidden":false,"merged":[[5,1,5,5],[5,6,5,8],[6,1,6,5],[6,6,6,8],[8,4,8,6],[3,10,3,14],[3,15,3,17],[0,0,0,8],[1,0,1,8],[2,1,2,5],[2,6,2,8],[3,1,3,5],[3,6,3,8],[4,1,4,5],[4,6,4,8],[7,19,7,21],[11,19,11,21],[0,18,0,23],[1,18,1,23],[3,19,3,21],[4,10,4,14],[4,15,4,17],[5,10,5,14],[5,15,5,17],[7,13,7,15],[0,9,0,17],[1,9,1,17],[2,10,2,14],[2,15,2,17]]}
["7 Team Bracket",null,null,null,null,null,null,null,null,{"$f":"A1","v":"7 Team Bracket"},null,null,null,null,null,null,null,null,{"$f":"J1","v":"7 Team Bracket"}]
["Pool A",null,null,null,null,null,null,null,null,"Pool B",null,null,null,null,null,null,null,null,"Playoffs"]
["Team","Name",null,null,null,null,"Contact",null,null,"Team","Name",null,null,null,null,"Contact"]
[1,"Pool A1",null,null,null,null,null,null,null,1,"Pool B1",null,null,null,null,null,null,null,"Game","Play-in Games",null,null,"Court","Time"]
[2,"Pool A2",null,null,null,null,null,null,null,2,"Pool B2",null,null,null,null,null,null,null,10,"Pool A #2 Seed","vs.","Pool B #3 Seed"]
[3,"Pool A3",null,null,null,null,null,null,null,3,"Pool B3",null,null,null,null,null,null,null,11,"Pool B #2 Seed","vs.","Pool A #3 Seed"]
[4,"Pool A4"]
[null,null,null,null,null,null,null,null,null,"Game",null,null,null,"Teams",null,null,"Court","Time","Game","Semi-Final Games",null,null,"Court","Time"]
["Game",null,null,null,"Teams",null,null,"Court","Time",7,1,"vs.",2,{"$f":"CONCATENATE((IF($J$4=K9,$K$4,IF($J$5=K9,$K$5,IF($J$6=K9,$K$6,IF($J$7=K9,$K$7,\"?\"))))))","v":"Pool B1"},"vs.",{"$f":"CONCATENATE((IF($J$4=M9,$K$4,IF($J$5=M9,$K$5,IF($J$6=M9,$K$6,IF($J$7=M9,$K$7,\"?\"))))))","v":"Pool B2"},null,null,12,"Winner Game 10","vs.","Pool A #1 Seed"]
[1,1,"vs.",2,{"$f":"CONCATENATE((IF($A$4=B10,$B$4,IF($A$5=B10,$B$5,IF($A$6=B10,$B$6,IF($A$7=B10,$B$7,\"?\"))))))","v":"Pool A1"},"vs.",{"$f":"CONCATENATE((IF($A$4=D10,$B$4,IF($A$5=D10,$B$5,IF($A$6=D10,$B$6,IF($A$7=D10,$B$7,\"?\"))))))","v":"Pool A2"},null,null,8,2,"vs.",3,{"$f":"CONCATENATE((IF($J$4=K10,$K$4,IF($J$5=K10,$K$5,IF($J$6=K10,$K$6,IF($J$7=K10,$K$7,\"?\"))))))","v":"Pool B2"},"vs.",{"$f":"CONCATENATE((IF($J$4=M10,$K$4,IF($J$5=M10,$K$5,IF($J$6=M10,$K$6,IF($J$7=M10,$K$7,\"?\"))))))","v":"Pool B3"},null,null,13,"Winner Game 11","vs.","Pool B #1 Seed"]
[2,3,"vs.",4,{"$f":"CONCATENATE((IF($A$4=B11,$B$4,IF($A$5=B11,$B$5,IF($A$6=B11,$B$6,IF($A$7=B11,$B$7,\"?\"))))))","v":"Pool A3"},"vs.","Pool A4",null,null,9,1,"vs.",3,{"$f":"CONCATENATE((IF($J$4=K11,$K$4,IF($J$5=K11,$K$5,IF($J$6=K11,$K$6,IF($J$7=K11,$K$7,\"?\"))))))","v":"Pool B1"},"vs.",{"$f":"CONCATENATE((IF($J$4=M11,$K$4,IF($J$5=M11,$K$5,IF($J$6=M11,$K$6,IF($J$7=M11,$K$7,\"?\"))))))","v":"Pool B3"}]
[3,1,"vs.",3,"Pool A1","vs.","Pool A3",null,null,null,null,null,null,null,null,null,null,null,"Game","Championship Game",null,null,"Court","Time"]
[4,2,"vs.",4,"Pool A2","vs.","Pool A4",null,null,null,null,null,null,null,null,null,null,null,14,"Winner Game 12","vs.","Winner Game 13"]
[5,1,"vs.",4,"Pool A1","vs.","Pool A4"]
[6,2,"vs.",3,"Pool A2","vs.","Pool A3"]

{"sheet":"8 Teams","index":14,"n_rows":15,"n_cols":24,"rows_kept":15,"cut":false,"hidden":false,"merged":[[0,0,0,8],[1,0,1,8],[2,1,2,5],[2,6,2,8],[3,1,3,5],[3,6,3,8],[8,13,8,15],[4,6,4,8],[5,1,5,5],[5,6,5,8],[6,1,6,5],[6,6,6,8],[4,1,4,5],[0,18,0,23],[1,18,1,23],[3,19,3,21],[8,4,8,6],[0,9,0,17],[1,9,1,17],[2,10,2,14],[2,15,2,17],[3,10,3,14],[3,15,3,17],[4,10,4,14],[4,15,4,17],[5,10,5,14],[5,15,5,17],[6,10,6,14],[6,15,6,17]]}
["8 Team Bracket",null,null,null,null,null,null,null,null,{"$f":"A1","v":"8 Team Bracket"},null,null,null,null,null,null,null,null,{"$f":"A1","v":"8 Team Bracket"}]
["Pool A",null,null,null,null,null,null,null,null,"Pool B",null,null,null,null,null,null,null,null,"Playoffs"]
["Team","Name",null,null,null,null,"Contact",null,null,"Team","Name",null,null,null,null,"Contact"]
[1,"Pool A1",null,null,null,null,null,null,null,1,"Pool B1",null,null,null,null,null,null,null,"Game","Championship Game",null,null,"Court","Time"]
[2,"Pool A2",null,null,null,null,null,null,null,2,"Pool B2",null,null,null,null,null,null,null,13,"Pool A #1 Seed","vs.","Pool B #1 Seed"]
[3,"Pool A3",null,null,null,null,null,null,null,3,"Pool B3"]
[4,"Pool A4",null,null,null,null,null,null,null,4,"Pool B4"]
[]
["Game",null,null,null,"Teams",null,null,"Court","Time","Game",null,null,null,"Teams",null,null,"Court","Time"]
[1,1,"vs.",2,{"$f":"CONCATENATE((IF($A$4=B10,$B$4,IF($A$5=B10,$B$5,IF($A$6=B10,$B$6,IF($A$7=B10,$B$7,\"?\"))))))","v":"Pool A1"},"vs.",{"$f":"CONCATENATE((IF($A$4=D10,$B$4,IF($A$5=D10,$B$5,IF($A$6=D10,$B$6,IF($A$7=D10,$B$7,\"?\"))))))","v":"Pool A2"},null,null,7,1,"vs.",2,{"$f":"CONCATENATE((IF($J$4=K10,$K$4,IF($J$5=K10,$K$5,IF($J$6=K10,$K$6,IF($J$7=K10,$K$7,\"?\"))))))","v":"Pool B1"},"vs.",{"$f":"CONCATENATE((IF($J$4=M10,$K$4,IF($J$5=M10,$K$5,IF($J$6=M10,$K$6,IF($J$7=M10,$K$7,\"?\"))))))","v":"Pool B2"}]
[2,3,"vs.",4,{"$f":"CONCATENATE((IF($A$4=B11,$B$4,IF($A$5=B11,$B$5,IF($A$6=B11,$B$6,IF($A$7=B11,$B$7,\"?\"))))))","v":"Pool A3"},"vs.","Pool A4",null,null,8,3,"vs.",4,{"$f":"CONCATENATE((IF($J$4=K11,$K$4,IF($J$5=K11,$K$5,IF($J$6=K11,$K$6,IF($J$7=K11,$K$7,\"?\"))))))","v":"Pool B3"},"vs.","Pool B4"]
[3,1,"vs.",3,"Pool A1","vs.","Pool A3",null,null,9,1,"vs.",3,"Pool B1","vs.","Pool B3"]
[4,2,"vs.",4,"Pool A2","vs.","Pool A4",null,null,10,2,"vs.",4,"Pool B2","vs.","Pool B4"]
[5,1,"vs.",4,"Pool A1","vs.","Pool A4",null,null,11,1,"vs.",4,"Pool B1","vs.","Pool B4"]
[6,2,"vs.",3,"Pool A2","vs.","Pool A3",null,null,12,2,"vs.",3,"Pool B2","vs.","Pool B3"]

{"sheet":"9 team","index":15,"n_rows":20,"n_cols":24,"rows_kept":20,"cut":false,"hidden":false,"merged":[[8,13,8,15],[0,0,0,8],[1,0,1,8],[2,1,2,5],[2,6,2,8],[3,1,3,5],[3,6,3,8],[4,1,4,5],[4,6,4,8],[5,1,5,5],[5,6,5,8],[6,1,6,5],[6,6,6,8],[7,1,7,5],[7,6,7,8],[0,18,0,23],[1,18,1,23],[3,19,3,21],[9,4,9,6],[0,9,0,17],[1,9,1,17],[2,10,2,14],[2,15,2,17],[3,10,3,14],[3,15,3,17],[4,10,4,14],[4,15,4,17],[5,10,5,14],[5,15,5,17],[6,10,6,14],[6,15,6,17]]}
["9 Team Bracket",null,null,null,null,null,null,null,null,{"$f":"A1","v":"9 Team Bracket"},null,null,null,null,null,null,null,null,{"$f":"A1","v":"9 Team Bracket"}]
["Pool A",null,null,null,null,null,null,null,null,"Pool B",null,null,null,null,null,null,null,null,"Playoffs"]
["Team","Name",null,null,null,null,"Contact",null,null,"Team","Name",null,null,null,null,"Contact"]
[1,"Pool A1",null,null,null,null,null,null,null,1,"Pool B1",null,null,null,null,null,null,null,"Game","Championship Game",null,null,"Court","Time"]
[2,"Pool A2",null,null,null,null,null,null,null,2,"Pool B2",null,null,null,null,null,null,null,17,"Pool A #1 Seed","vs.","Pool B #1 Seed"]
[3,"Pool A3",null,null,null,null,null,null,null,3,"Pool B3"]
[4,"Pool A4",null,null,null,null,null,null,null,4,"Pool B4"]
[5,"Pool A5"]
[null,null,null,null,null,null,null,null,null,"Game",null,null,null,"Teams",null,null,"Court","Time"]
["Game",null,null,null,"Teams",null,null,"Court","Time",11,1,"vs.",2,{"$f":"CONCATENATE((IF($J$4=K10,$K$4,IF($J$5=K10,$K$5,IF($J$6=K10,$K$6,IF($J$7=K10,$K$7,\"?\"))))))","v":"Pool B1"},"vs.",{"$f":"CONCATENATE((IF($J$4=M10,$K$4,IF($J$5=M10,$K$5,IF($J$6=M10,$K$6,IF($J$7=M10,$K$7,\"?\"))))))","v":"Pool B2"}]
[1,1,"vs.",4,{"$f":"CONCATENATE((IF($A$4=B11,$B$4,IF($A$5=B11,$B$5,IF($A$6=B11,$B$6,IF($A$7=B11,$B$7,IF($A$8=B11,$B$8)))))))","v":"Pool A1"},"vs.",{"$f":"CONCATENATE((IF($A$4=D11,$B$4,IF($A$5=D11,$B$5,IF($A$6=D11,$B$6,IF($A$7=D11,$B$7,IF($A$8=D11,$B$8)))))))","v":"Pool A4"},null,null,12,3,"vs.",4,{"$f":"CONCATENATE((IF($J$4=K11,$K$4,IF($J$5=K11,$K$5,IF($J$6=K11,$K$6,IF($J$7=K11,$K$7,\"?\"))))))","v":"Pool B3"},"vs.",{"$f":"CONCATENATE((IF($J$4=M11,$K$4,IF($J$5=M11,$K$5,IF($J$6=M11,$K$6,IF($J$7=M11,$K$7,\"?\"))))))","v":"Pool B4"}]
[2,2,"vs.",3,{"$f":"CONCATENATE((IF($A$4=B12,$B$4,IF($A$5=B12,$B$5,IF($A$6=B12,$B$6,IF($A$7=B12,$B$7,IF($A$8=B12,$B$8)))))))","v":"Pool A2"},"vs.",{"$f":"CONCATENATE((IF($A$4=D12,$B$4,IF($A$5=D12,$B$5,IF($A$6=D12,$B$6,IF($A$7=D12,$B$7,IF($A$8=D12,$B$8)))))))","v":"Pool A3"},null,null,13,1,"vs.",3,"Pool B1","vs.","Pool B3"]
[3,1,"vs.",3,"Pool A1","vs.","Pool A3",null,null,14,2,"vs.",4,"Pool B2","vs.","Pool B4"]
[4,4,"vs.",5,"Pool A4","vs.","Pool A5",null,null,15,1,"vs.",4,"Pool B1","vs.","Pool B4"]
[5,3,"vs.",5,"Pool A3","vs.","Pool A5",null,null,16,2,"vs.",3,"Pool B2","vs.","Pool B3"]
[6,1,"vs.",2,"Pool A1","vs.","Pool A2"]
[7,2,"vs.",5,"Pool A2","vs.","Pool A5"]
[8,3,"vs.",4,"Pool A3","vs.","Pool A4"]
[9,2,"vs.",4,"Pool A2","vs.","Pool A4"]
[10,1,"vs.",5,"Pool A1","vs.","Pool A5"]

{"sheet":"10 team","index":16,"n_rows":20,"n_cols":24,"rows_kept":20,"cut":false,"hidden":false,"merged":[[0,0,0,8],[1,0,1,8],[2,1,2,5],[2,6,2,8],[3,1,3,5],[3,6,3,8],[5,1,5,5],[5,6,5,8],[6,1,6,5],[6,6,6,8],[4,1,4,5],[7,1,7,5],[7,6,7,8],[9,4,9,6],[0,9,0,17],[1,9,1,17],[2,10,2,14],[2,15,2,17],[3,10,3,14],[3,15,3,17],[4,10,4,14],[4,15,4,17],[5,10,5,14],[5,15,5,17],[6,10,6,14],[6,15,6,17],[4,6,4,8],[7,10,7,14],[7,15,7,17],[9,13,9,15],[0,18,0,23],[1,18,1,23],[3,19,3,21]]}
["10 Team Bracket",null,null,null,null,null,null,null,null,{"$f":"A1","v":"10 Team Bracket"},null,null,null,null,null,null,null,null,{"$f":"A1","v":"10 Team Bracket"}]
["Pool A",null,null,null,null,null,null,null,null,"Pool B",null,null,null,null,null,null,null,null,"Playoffs"]
["Team","Name",null,null,null,null,"Contact",null,null,"Team","Name",null,null,null,null,"Contact"]
[1,"Pool A1",null,null,null,null,null,null,null,1,"Pool B1",null,null,null,null,null,null,null,"Game","Championship Game",null,null,"Court","Time"]
[2,"Pool A2",null,null,null,null,null,null,null,2,"Pool B2",null,null,null,null,null,null,null,21,"Pool A #1 Seed","vs.","Pool B #1 Seed"]
[3,"Pool A3",null,null,null,null,null,null,null,3,"Pool B3"]
[4,"Pool A4",null,null,null,null,null,null,null,4,"Pool B4"]
[5,"Pool A5",null,null,null,null,null,null,null,5,"Pool B5"]
[]
["Game",null,null,null,"Teams",null,null,"Court","Time","Game",null,null,null,"Teams",null,null,"Court","Time"]
[1,1,"vs.",4,{"$f":"CONCATENATE((IF($A$4=B11,$B$4,IF($A$5=B11,$B$5,IF($A$6=B11,$B$6,IF($A$7=B11,$B$7,IF($A$8=B11,$B$8)))))))","v":"Pool A1"},"vs.",{"$f":"CONCATENATE((IF($A$4=D11,$B$4,IF($A$5=D11,$B$5,IF($A$6=D11,$B$6,IF($A$7=D11,$B$7,IF($A$8=D11,$B$8)))))))","v":"Pool A4"},null,null,11,1,"vs.",4,{"$f":"CONCATENATE((IF($J$4=K11,$K$4,IF($J$5=K11,$K$5,IF($J$6=K11,$K$6,IF($J$7=K11,$K$7,IF($J$8=K11,$K$8)))))))","v":"Pool B1"},"vs.",{"$f":"CONCATENATE((IF($J$4=M11,$K$4,IF($J$5=M11,$K$5,IF($J$6=M11,$K$6,IF($J$7=M11,$K$7,IF($J$8=M11,$K$8)))))))","v":"Pool B4"}]
[2,2,"vs.",3,{"$f":"CONCATENATE((IF($A$4=B12,$B$4,IF($A$5=B12,$B$5,IF($A$6=B12,$B$6,IF($A$7=B12,$B$7,IF($A$8=B12,$B$8)))))))","v":"Pool A2"},"vs.",{"$f":"CONCATENATE((IF($A$4=D12,$B$4,IF($A$5=D12,$B$5,IF($A$6=D12,$B$6,IF($A$7=D12,$B$7,IF($A$8=D12,$B$8)))))))","v":"Pool A3"},null,null,12,2,"vs.",3,{"$f":"CONCATENATE((IF($J$4=K12,$K$4,IF($J$5=K12,$K$5,IF($J$6=K12,$K$6,IF($J$7=K12,$K$7,IF($J$8=K12,$K$8)))))))","v":"Pool B2"},"vs.",{"$f":"CONCATENATE((IF($J$4=M12,$K$4,IF($J$5=M12,$K$5,IF($J$6=M12,$K$6,IF($J$7=M12,$K$7,IF($J$8=M12,$K$8)))))))","v":"Pool B3"}]
[3,1,"vs.",3,"Pool A1","vs.","Pool A3",null,null,13,1,"vs.",3,"Pool B1","vs.","Pool B3"]
[4,4,"vs.",5,"Pool A4","vs.","Pool A5",null,null,14,4,"vs.",5,"Pool B4","vs.","Pool B5"]
[5,3,"vs.",5,"Pool A3","vs.","Pool A5",null,null,15,3,"vs.",5,"Pool B3","vs.","Pool B5"]
[6,1,"vs.",2,"Pool A1","vs.","Pool A2",null,null,16,1,"vs.",2,"Pool B1","vs.","Pool B2"]
[7,2,"vs.",5,"Pool A2","vs.","Pool A5",null,null,17,2,"vs.",5,"Pool B2","vs.","Pool B5"]
[8,3,"vs.",4,"Pool A3","vs.","Pool A4",null,null,18,3,"vs.",4,"Pool B3","vs.","Pool B4"]
[9,2,"vs.",4,"Pool A2","vs.","Pool A4",null,null,19,2,"vs.",4,"Pool B2","vs.","Pool B4"]
[10,1,"vs.",5,"Pool A1","vs.","Pool A5",null,null,20,1,"vs.",5,"Pool B1","vs.","Pool B5"]

{"sheet":"11 teams","index":17,"n_rows":23,"n_cols":24,"rows_kept":23,"cut":false,"hidden":false,"merged":[[0,0,0,8],[1,0,1,8],[2,1,2,5],[2,6,2,8],[3,1,3,5],[3,6,3,8],[9,13,9,15],[10,4,10,6],[4,1,4,5],[4,6,4,8],[5,1,5,5],[5,6,5,8],[6,1,6,5],[6,6,6,8],[7,10,7,14],[7,15,7,17],[7,1,7,5],[7,6,7,8],[8,1,8,5],[8,6,8,8],[4,10,4,14],[4,15,4,17],[5,10,5,14],[5,15,5,17],[6,10,6,14],[6,15,6,17],[0,18,0,23],[1,18,1,23],[3,19,3,21],[0,9,0,17],[1,9,1,17],[2,10,2,14],[2,15,2,17],[3,10,3,14],[3,15,3,17]]}
["11 Team Bracket",null,null,null,null,null,null,null,null,{"$f":"A1","v":"11 Team Bracket"},null,null,null,null,null,null,null,null,{"$f":"A1","v":"11 Team Bracket"}]
["Pool A",null,null,null,null,null,null,null,null,"Pool B",null,null,null,null,null,null,null,null,"Playoffs"]
["Team","Name",null,null,null,null,"Contact",null,null,"Team","Name",null,null,null,null,"Contact"]
[1,"Pool A1",null,null,null,null,null,null,null,1,"Pool B1",null,null,null,null,null,null,null,"Game","Championship Game",null,null,"Court","Time"]
[2,"Pool A2",null,null,null,null,null,null,null,2,"Pool B2",null,null,null,null,null,null,null,23,"Pool A #1 Seed","vs.","Pool B #1 Seed"]
[3,"Pool A3",null,null,null,null,null,null,null,3,"Pool B3"]
[4,"Pool A4",null,null,null,null,null,null,null,4,"Pool B4"]
[5,"Pool A5",null,null,null,null,null,null,null,5,"Pool B5"]
[6,"Pool A6"]
[null,null,null,null,null,null,null,null,null,"Game",null,null,null,"Teams",null,null,"Court","Time"]
["Game",null,null,null,"Teams",null,null,"Court","Time",13,1,"vs.",4,{"$f":"CONCATENATE((IF($J$4=K11,$K$4,IF($J$5=K11,$K$5,IF($J$6=K11,$K$6,IF($J$7=K11,$K$7,IF($J$8=K11,$K$8)))))))","v":"Pool B1"},"vs.",{"$f":"CONCATENATE((IF($J$4=M11,$K$4,IF($J$5=M11,$K$5,IF($J$6=M11,$K$6,IF($J$7=M11,$K$7,IF($J$8=M11,$K$8)))))))","v":"Pool B4"}]
[1,1,"vs.",2,{"$f":"CONCATENATE((IF($A$4=B12,$B$4,IF($A$5=B12,$B$5,IF($A$6=B12,$B$6,IF($A$7=B12,$B$7,IF($A$8=B12,$B$8,IF($A$9=B12,$B$9))))))))","v":"Pool A1"},"vs.",{"$f":"CONCATENATE((IF($A$4=D12,$B$4,IF($A$5=D12,$B$5,IF($A$6=D12,$B$6,IF($A$7=D12,$B$7,IF($A$8=D12,$B$8,IF($A$9=D12,$B$9))))))))","v":"Pool A2"},null,null,14,2,"vs.",3,{"$f":"CONCATENATE((IF($J$4=K12,$K$4,IF($J$5=K12,$K$5,IF($J$6=K12,$K$6,IF($J$7=K12,$K$7,IF($J$8=K12,$K$8)))))))","v":"Pool B2"},"vs.",{"$f":"CONCATENATE((IF($J$4=M12,$K$4,IF($J$5=M12,$K$5,IF($J$6=M12,$K$6,IF($J$7=M12,$K$7,IF($J$8=M12,$K$8)))))))","v":"Pool B3"}]
[2,3,"vs.",6,{"$f":"CONCATENATE((IF($A$4=B13,$B$4,IF($A$5=B13,$B$5,IF($A$6=B13,$B$6,IF($A$7=B13,$B$7,IF($A$8=B13,$B$8)))))))","v":"Pool A3"},"vs.",{"$f":"CONCATENATE((IF($A$4=D13,$B$4,IF($A$5=D13,$B$5,IF($A$6=D13,$B$6,IF($A$7=D13,$B$7,IF($A$8=D13,$B$8,IF($A$9=D13,$B$9))))))))","v":"Pool A6"},null,null,15,1,"vs.",3,"Pool B1","vs.","Pool B3"]
[3,4,"vs.",5,"Pool A4","vs.","Pool A5",null,null,16,4,"vs.",5,"Pool B4","vs.","Pool B5"]
[4,3,"vs.",4,"Pool A3","vs.","Pool A4",null,null,17,3,"vs.",5,"Pool B3","vs.","Pool B5"]
[5,1,"vs.",6,"Pool A1","vs.","Pool A6",null,null,18,1,"vs.",2,"Pool B1","vs.","Pool B2"]
[6,2,"vs.",5,"Pool A2","vs.","Pool A5",null,null,19,2,"vs.",5,"Pool B2","vs.","Pool B5"]
[7,4,"vs.",6,"Pool A4","vs.","Pool A6",null,null,20,3,"vs.",4,"Pool B3","vs.","Pool B4"]
[8,2,"vs.",3,"Pool A2","vs.","Pool A3",null,null,21,2,"vs.",4,"Pool B2","vs.","Pool B4"]
[9,1,"vs.",5,"Pool A1","vs.","Pool A5",null,null,22,1,"vs.",5,"Pool B1","vs.","Pool B5"]
[10,1,"vs.",4,"Pool A1","vs.","Pool A4"]
[11,3,"vs.",5,"Pool A3","vs.","Pool A5"]
[12,2,"vs.",6,"Pool A2","vs.","Pool A6"]

{"sheet":"12 team","index":18,"n_rows":15,"n_cols":33,"rows_kept":15,"cut":false,"hidden":false,"merged":[[0,27,0,32],[1,27,1,32],[3,28,3,30],[6,28,6,30],[2,1,2,5],[0,0,0,8],[1,0,1,8],[3,1,3,5],[4,1,4,5],[2,6,2,8],[3,6,3,8],[4,6,4,8],[5,6,5,8],[6,6,6,8],[0,9,0,17],[1,9,1,17],[2,10,2,14],[2,15,2,17],[3,10,3,14],[3,15,3,17],[0,18,0,26],[1,18,1,26],[2,19,2,23],[2,24,2,26],[3,19,3,23],[3,24,3,26],[4,19,4,23],[4,24,4,26],[5,19,5,23],[5,24,5,26],[6,19,6,23],[6,24,6,26],[4,10,4,14],[4,15,4,17],[5,10,5,14],[5,15,5,17],[6,10,6,14],[6,15,6,17],[8,4,8,6],[8,13,8,15],[8,22,8,24],[6,1,6,5],[5,1,5,5]]}
["12 Team Bracket",null,null,null,null,null,null,null,null,{"$f":"A1","v":"12 Team Bracket"},null,null,null,null,null,null,null,null,{"$f":"J1","v":"12 Team Bracket"},null,null,null,null,null,null,null,null,{"$f":"A1","v":"12 Team Bracket"}]
["Pool A",null,null,null,null,null,null,null,null,"Pool B",null,null,null,null,null,null,null,null,"Pool C",null,null,null,null,null,null,null,null,"Playoffs"]
["Team","Name",null,null,null,null,"Contact",null,null,"Team","Name",null,null,null,null,"Contact",null,null,"Team","Name",null,null,null,null,"Contact"]
[1,"Pool A1",null,null,null,null,null,null,null,1,"Pool B1",null,null,null,null,null,null,null,1,"Pool C1",null,null,null,null,null,null,null,"Game","Semi-Final Game",null,null,"Court","Time"]
[2,"Pool A2",null,null,null,null,null,null,null,2,"Pool B2",null,null,null,null,null,null,null,2,"Pool C2",null,null,null,null,null,null,null,19,"#2 Seeded Pool Winner","vs.","#3 Seeded Pool Winner"]
[3,"Pool A3",null,null,null,null,null,null,null,3,"Pool B3",null,null,null,null,null,null,null,3,"Pool C3"]
[4,"Pool A4",null,null,null,null,null,null,null,4,"Pool B4",null,null,null,null,null,null,null,4,"Pool C4",null,null,null,null,null,null,null,"Game","Championship Game",null,null,"Court","Time"]
[null,null,null,null,null,null,null,null,null,null,null,null,null,null,null,null,null,null,null,null,null,null,null,null,null,null,null,20,"#1 Seeded Pool Winner","vs.","Winner of Game 19"]
["Game",null,null,null,"Teams",null,null,"Court","Time","Game",null,null,null,"Teams",null,null,"Court","Time","Game",null,null,null,"Teams",null,null,"Court","Time"]
[1,1,"vs.",2,{"$f":"CONCATENATE((IF($A$4=B10,$B$4,IF($A$5=B10,$B$5,IF($A$6=B10,$B$6,IF($A$7=B10,$B$7))))))","v":"Pool A1"},"vs.",{"$f":"CONCATENATE(IF($A$4=D10,$B$4,IF($A$5=D10,$B$5,IF($A$6=D10,$B$6,IF($A$7=D10,$B$7)))))","v":"Pool A2"},null,null,7,1,"vs.",2,{"$f":"CONCATENATE((IF($J$4=K10,$K$4,IF($J$5=K10,$K$5,IF($J$6=K10,$K$6,IF($J$7=K10,$K$7))))))","v":"Pool B1"},"vs.",{"$f":"CONCATENATE((IF($J$4=M10,$K$4,IF($J$5=M10,$K$5,IF($J$6=M10,$K$6,IF($J$7=M10,$K$7))))))","v":"Pool B2"},null,null,13,1,"vs.",2,{"$f":"CONCATENATE((IF($S$4=T10,$T$4,IF($S$5=T10,$T$5,IF($S$6=T10,$T$6,IF($S$7=T10,$T$7))))))","v":"Pool C1"},"vs.",{"$f":"CONCATENATE((IF($S$4=V10,$T$4,IF($S$5=V10,$T$5,IF($S$6=V10,$T$6,IF($S$7=V10,$T$7))))))","v":"Pool C2"}]
[2,3,"vs.",4,{"$f":"CONCATENATE((IF($A$4=B11,$B$4,IF($A$5=B11,$B$5,IF($A$6=B11,$B$6,IF($A$7=B11,$B$7))))))","v":"Pool A3"},"vs.",{"$f":"CONCATENATE(IF($A$4=D11,$B$4,IF($A$5=D11,$B$5,IF($A$6=D11,$B$6,IF($A$7=D11,$B$7)))))","v":"Pool A4"},null,null,8,3,"vs.",4,{"$f":"CONCATENATE((IF($J$4=K11,$K$4,IF($J$5=K11,$K$5,IF($J$6=K11,$K$6,IF($J$7=K11,$K$7))))))","v":"Pool B3"},"vs.",{"$f":"CONCATENATE((IF($J$4=M11,$K$4,IF($J$5=M11,$K$5,IF($J$6=M11,$K$6,IF($J$7=M11,$K$7))))))","v":"Pool B4"},null,null,14,3,"vs.",4,{"$f":"CONCATENATE((IF($S$4=T11,$T$4,IF($S$5=T11,$T$5,IF($S$6=T11,$T$6,IF($S$7=T11,$T$7))))))","v":"Pool C3"},"vs.",{"$f":"CONCATENATE((IF($S$4=V11,$T$4,IF($S$5=V11,$T$5,IF($S$6=V11,$T$6,IF($S$7=V11,$T$7))))))","v":"Pool C4"}]
[3,1,"vs.",3,"Pool A1","vs.","Pool A3",null,null,9,1,"vs.",3,"Pool B1","vs.","Pool B3",null,null,15,1,"vs.",3,"Pool C1","vs.","Pool C3"]
[4,2,"vs.",4,"Pool A2","vs.","Pool A4",null,null,10,2,"vs.",4,"Pool B2","vs.","Pool B4",null,null,16,2,"vs.",4,"Pool C2","vs.","Pool C4"]
[5,1,"vs.",4,"Pool A1","vs.","Pool A4",null,null,11,1,"vs.",4,"Pool B1","vs.","Pool B4",null,null,17,1,"vs.",4,"Pool C1","vs.","Pool C4"]
[6,2,"vs.",3,"Pool A2","vs.","Pool A3",null,null,12,2,"vs.",3,"Pool B2","vs.","Pool B3",null,null,18,2,"vs.",3,"Pool C2","vs.","Pool C3"]

{"sheet":"13 team","index":19,"n_rows":20,"n_cols":33,"rows_kept":20,"cut":false,"hidden":false,"merged":[[1,0,1,8],[2,1,2,5],[2,6,2,8],[3,1,3,5],[3,6,3,8],[7,1,7,5],[7,6,7,8],[9,4,9,6],[0,9,0,17],[1,9,1,17],[2,10,2,14],[2,15,2,17],[3,10,3,14],[3,15,3,17],[4,1,4,5],[4,6,4,8],[5,1,5,5],[5,6,5,8],[6,1,6,5],[6,6,6,8],[0,0,0,8],[3,24,3,26],[8,13,8,15],[4,10,4,14],[4,15,4,17],[5,10,5,14],[5,15,5,17],[6,10,6,14],[6,15,6,17],[0,27,0,32],[1,27,1,32],[6,28,6,30],[8,22,8,24],[3,28,3,30],[4,19,4,23],[4,24,4,26],[5,19,5,23],[5,24,5,26],[6,19,6,23],[6,24,6,26],[0,18,0,26],[1,18,1,26],[2,19,2,23],[2,24,2,26],[3,19,3,23]]}
["13 Team Bracket",null,null,null,null,null,null,null,null,{"$f":"A1","v":"13 Team Bracket"},null,null,null,null,null,null,null,null,{"$f":"J1","v":"13 Team Bracket"},null,null,null,null,null,null,null,null,{"$f":"S1","v":"13 Team Bracket"}]
["Pool A",null,null,null,null,null,null,null,null,"Pool B",null,null,null,null,null,null,null,null,"Pool C",null,null,null,null,null,null,null,null,"Playoffs"]
["Team","Name",null,null,null,null,"Contact",null,null,"Team","Name",null,null,null,null,"Contact",null,null,"Team","Name",null,null,null,null,"Contact"]
[1,"Pool A1",null,null,null,null,null,null,null,1,"Pool B1",null,null,null,null,null,null,null,1,"Pool C1",null,null,null,null,null,null,null,"Game","Semi-Final Game",null,null,"Court","Time"]
[2,"Pool A2",null,null,null,null,null,null,null,2,"Pool B2",null,null,null,null,null,null,null,2,"Pool C2",null,null,null,null,null,null,null,23,"#2 Seeded Pool Winner","vs.","#3 Seeded Pool Winner"]
[3,"Pool A3",null,null,null,null,null,null,null,3,"Pool B3",null,null,null,null,null,null,null,3,"Pool C3"]
[4,"Pool A4",null,null,null,null,null,null,null,4,"Pool B4",null,null,null,null,null,null,null,4,"Pool C4",null,null,null,null,null,null,null,"Game","Championship Game",null,null,"Court","Time"]
[5,"Pool A5",null,null,null,null,null,null,null,null,null,null,null,null,null,null,null,null,null,null,null,null,null,null,null,null,null,24,"#1 Seeded Pool Winner","vs.","Winner of Game 23"]
[null,null,null,null,null,null,null,null,null,"Game",null,null,null,"Teams",null,null,"Court","Time","Game",null,null,null,"Teams",null,null,"Court","Time"]
["Game",null,null,null,"Teams",null,null,"Court","Time",11,1,"vs.",2,{"$f":"CONCATENATE((IF($J$4=K10,$K$4,IF($J$5=K10,$K$5,IF($J$6=K10,$K$6,IF($J$7=K10,$K$7,\"?\"))))))","v":"Pool B1"},"vs.",{"$f":"CONCATENATE((IF($J$4=M10,$K$4,IF($J$5=M10,$K$5,IF($J$6=M10,$K$6,IF($J$7=M10,$K$7,\"?\"))))))","v":"Pool B2"},null,null,17,1,"vs.",2,{"$f":"CONCATENATE((IF($S$4=T10,$T$4,IF($S$5=T10,$T$5,IF($S$6=T10,$T$6,IF($S$7=T10,$T$7,\"?\"))))))","v":"Pool C1"},"vs.",{"$f":"CONCATENATE((IF($S$4=V10,$T$4,IF($S$5=V10,$T$5,IF($S$6=V10,$T$6,IF($S$7=V10,$T$7,\"?\"))))))","v":"Pool C2"}]
[1,1,"vs.",4,{"$f":"CONCATENATE((IF($A$4=B11,$B$4,IF($A$5=B11,$B$5,IF($A$6=B11,$B$6,IF($A$7=B11,$B$7,IF($A$8=B11,$B$8)))))))","v":"Pool A1"},"vs.",{"$f":"CONCATENATE((IF($A$4=D11,$B$4,IF($A$5=D11,$B$5,IF($A$6=D11,$B$6,IF($A$7=D11,$B$7,IF($A$8=D11,$B$8)))))))","v":"Pool A4"},null,null,12,3,"vs.",4,{"$f":"CONCATENATE((IF($J$4=K11,$K$4,IF($J$5=K11,$K$5,IF($J$6=K11,$K$6,IF($J$7=K11,$K$7,\"?\"))))))","v":"Pool B3"},"vs.",{"$f":"CONCATENATE((IF($J$4=M11,$K$4,IF($J$5=M11,$K$5,IF($J$6=M11,$K$6,IF($J$7=M11,$K$7,\"?\"))))))","v":"Pool B4"},null,null,18,3,"vs.",4,{"$f":"CONCATENATE((IF($S$4=T11,$T$4,IF($S$5=T11,$T$5,IF($S$6=T11,$T$6,IF($S$7=T11,$T$7,\"?\"))))))","v":"Pool C3"},"vs.",{"$f":"CONCATENATE((IF($S$4=V11,$T$4,IF($S$5=V11,$T$5,IF($S$6=V11,$T$6,IF($S$7=V11,$T$7,\"?\"))))))","v":"Pool C4"}]
[2,2,"vs.",3,{"$f":"CONCATENATE((IF($A$4=B12,$B$4,IF($A$5=B12,$B$5,IF($A$6=B12,$B$6,IF($A$7=B12,$B$7,IF($A$8=B12,$B$8)))))))","v":"Pool A2"},"vs.",{"$f":"CONCATENATE((IF($A$4=D12,$B$4,IF($A$5=D12,$B$5,IF($A$6=D12,$B$6,IF($A$7=D12,$B$7,IF($A$8=D12,$B$8)))))))","v":"Pool A3"},null,null,13,1,"vs.",3,"Pool B1","vs.","Pool B3",null,null,19,1,"vs.",3,"Pool C1","vs.","Pool C3"]
[3,1,"vs.",3,"Pool A1","vs.","Pool A3",null,null,14,2,"vs.",4,"Pool B2","vs.","Pool B4",null,null,20,2,"vs.",4,"Pool C2","vs.","Pool C4"]
[4,4,"vs.",5,"Pool A4","vs.","Pool A5",null,null,15,1,"vs.",4,"Pool B1","vs.","Pool B4",null,null,21,1,"vs.",4,"Pool C1","vs.","Pool C4"]
[5,3,"vs.",5,"Pool A3","vs.","Pool A5",null,null,16,2,"vs.",3,"Pool B2","vs.","Pool B3",null,null,22,2,"vs.",3,"Pool C2","vs.","Pool C3"]
[6,1,"vs.",2,"Pool A1","vs.","Pool A2"]
[7,2,"vs.",5,"Pool A2","vs.","Pool A5"]
[8,3,"vs.",4,"Pool A3","vs.","Pool A4"]
[9,2,"vs.",4,"Pool A2","vs.","Pool A4"]
[10,1,"vs.",5,"Pool A1","vs.","Pool A5"]

{"sheet":"14 team","index":20,"n_rows":20,"n_cols":33,"rows_kept":20,"cut":false,"hidden":false,"merged":[[42,0,42,3],[81,0,81,3],[5,10,5,14],[6,10,6,14],[5,1,5,5],[6,1,6,5],[7,10,7,14],[9,4,9,6],[9,13,9,15],[7,1,7,5],[5,6,5,8],[6,6,6,8],[7,6,7,8],[0,0,0,8],[1,0,1,8],[0,9,0,17],[1,9,1,17],[4,1,4,5],[2,1,2,5],[3,1,3,5],[2,6,2,8],[3,6,3,8],[4,6,4,8],[1,18,1,26],[2,19,2,23],[3,19,3,23],[4,19,4,23],[2,10,2,14],[3,10,3,14],[4,10,4,14],[2,15,2,17],[2,24,2,26],[0,27,0,32],[1,27,1,32],[9,22,9,24],[3,15,3,17],[4,15,4,17],[5,15,5,17],[6,15,6,17],[7,15,7,17],[5,19,5,23],[6,19,6,23],[7,19,7,23],[3,24,3,26],[4,24,4,26],[5,24,5,26],[6,24,6,26],[0,18,0,26]]}
["14 Team Bracket",null,null,null,null,null,null,null,null,{"$f":"A1","v":"14 Team Bracket"},null,null,null,null,null,null,null,null,{"$f":"A1","v":"14 Team Bracket"},null,null,null,null,null,null,null,null,{"$f":"A1","v":"14 Team Bracket"}]
["Pool A",null,null,null,null,null,null,null,null,"Pool B",null,null,null,null,null,null,null,null,"Pool C",null,null,null,null,null,null,null,null,"Playoff"]
["Team","Name",null,null,null,null,"Contact",null,null,"Team","Name",null,null,null,null,"Contact",null,null,"Team","Name",null,null,null,null,"Contact",null,null,"Game",null,null,null,"Court","Time"]
[1,"Pool A1",null,null,null,null,null,null,null,1,"Pool B1",null,null,null,null,null,null,null,1,"Pool C1",null,null,null,null,null,null,null,27,"#2 Seed Pool Winner","vs.","#3 Seed Pool Winner"]
[2,"Pool A2",null,null,null,null,null,null,null,2,"Pool B2",null,null,null,null,null,null,null,2,"Pool C2"]
[3,"Pool A3",null,null,null,null,null,null,null,3,"Pool B3",null,null,null,null,null,null,null,3,"Pool C3",null,null,null,null,null,null,null,"Game",null,null,null,"Court","Time"]
[4,"Pool A4",null,null,null,null,null,null,null,4,"Pool B4",null,null,null,null,null,null,null,4,"Pool C4",null,null,null,null,null,null,null,28,"Winner Game 27","vs.","#1 Seed Pool Winner"]
[5,"Pool A5",null,null,null,null,null,null,null,5,"Pool B5"]
[]
["Game",null,null,null,"Teams",null,null,"Court","Time","Game",null,null,null,"Teams",null,null,"Court","Time","Game",null,null,null,"Teams",null,null,"Court","Time"]
[1,1,"vs.",4,{"$f":"CONCATENATE((IF($A$4=B11,$B$4,IF($A$5=B11,$B$5,IF($A$6=B11,$B$6,IF($A$7=B11,$B$7,IF($A$8=B11,$B$8)))))))","v":"Pool A1"},"vs.",{"$f":"CONCATENATE((IF($A$4=D11,$B$4,IF($A$5=D11,$B$5,IF($A$6=D11,$B$6,IF($A$7=D11,$B$7,IF($A$8=D11,$B$8)))))))","v":"Pool A4"},null,null,11,1,"vs.",4,{"$f":"CONCATENATE((IF($J$4=K11,$K$4,IF($J$5=K11,$K$5,IF($J$6=K11,$K$6,IF($J$7=K11,$K$7,IF($J$8=K11,$K$8)))))))","v":"Pool B1"},"vs.",{"$f":"CONCATENATE((IF($J$4=M11,$K$4,IF($J$5=M11,$K$5,IF($J$6=M11,$K$6,IF($J$7=M11,$K$7,IF($J$8=M11,$K$8)))))))","v":"Pool B4"},null,null,21,1,"vs.",2,{"$f":"CONCATENATE((IF($S$4=T11,$T$4,IF($S$5=T11,$T$5,IF($S$6=T11,$T$6,IF($S$7=T11,$T$7,IF($S$8=T11,$T$8)))))))","v":"Pool C1"},"vs.",{"$f":"CONCATENATE((IF($S$4=V11,$T$4,IF($S$5=V11,$T$5,IF($S$6=V11,$T$6,IF($S$7=V11,$T$7,IF($S$8=V11,$T$8)))))))","v":"Pool C2"}]
[2,2,"vs.",3,"Pool A2","vs.","Pool A3",null,null,12,2,"vs.",3,{"$f":"CONCATENATE((IF($J$4=K12,$K$4,IF($J$5=K12,$K$5,IF($J$6=K12,$K$6,IF($J$7=K12,$K$7,IF($J$8=K12,$K$8)))))))","v":"Pool B2"},"vs.",{"$f":"CONCATENATE((IF($J$4=M12,$K$4,IF($J$5=M12,$K$5,IF($J$6=M12,$K$6,IF($J$7=M12,$K$7,IF($J$8=M12,$K$8)))))))","v":"Pool B3"},null,null,22,3,"vs.",4,{"$f":"CONCATENATE((IF($S$4=T12,$T$4,IF($S$5=T12,$T$5,IF($S$6=T12,$T$6,IF($S$7=T12,$T$7,IF($S$8=T12,$T$8)))))))","v":"Pool C3"},"vs.",{"$f":"CONCATENATE((IF($S$4=V12,$T$4,IF($S$5=V12,$T$5,IF($S$6=V12,$T$6,IF($S$7=V12,$T$7,IF($S$8=V12,$T$8)))))))","v":"Pool C4"}]
[3,1,"vs.",3,"Pool A1","vs.","Pool A3",null,null,13,1,"vs.",3,"Pool B1","vs.","Pool B3",null,null,23,1,"vs.",3,"Pool C1","vs.","Pool C3"]
[4,4,"vs.",5,"Pool A4","vs.","Pool A5",null,null,14,4,"vs.",5,"Pool B4","vs.","Pool B5",null,null,24,2,"vs.",4,"Pool C2","vs.","Pool C4"]
[5,3,"vs.",5,"Pool A3","vs.","Pool A5",null,null,15,3,"vs.",5,"Pool B3","vs.","Pool B5",null,null,25,1,"vs.",4,"Pool C1","vs.","Pool C4"]
[6,1,"vs.",2,"Pool A1","vs.","Pool A2",null,null,16,1,"vs.",2,"Pool B1","vs.","Pool B2",null,null,26,2,"vs.",3,"Pool C2","vs.","Pool C3"]
[7,2,"vs.",5,"Pool A2","vs.","Pool A5",null,null,17,2,"vs.",5,"Pool B2","vs.","Pool B5"]
[8,3,"vs.",4,"Pool A3","vs.","Pool A4",null,null,18,3,"vs.",4,"Pool B3","vs.","Pool B4"]
[9,2,"vs.",4,"Pool A2","vs.","Pool A4",null,null,19,2,"vs.",4,"Pool B2","vs.","Pool B4"]
[10,1,"vs.",5,"Pool A1","vs.","Pool A5",null,null,20,1,"vs.",5,"Pool B1","vs.","Pool B5"]

{"sheet":"15 team","index":21,"n_rows":20,"n_cols":33,"rows_kept":20,"cut":false,"hidden":false,"merged":[[4,1,4,5],[4,6,4,8],[5,1,5,5],[0,0,0,8],[1,0,1,8],[2,1,2,5],[2,6,2,8],[3,1,3,5],[3,6,3,8],[5,6,5,8],[6,1,6,5],[6,6,6,8],[7,1,7,5],[7,6,7,8],[9,4,9,6],[0,9,0,17],[1,9,1,17],[2,10,2,14],[2,15,2,17],[3,10,3,14],[3,15,3,17],[4,15,4,17],[5,10,5,14],[5,15,5,17],[6,10,6,14],[6,15,6,17],[7,10,7,14],[7,15,7,17],[9,13,9,15],[0,18,0,26],[1,18,1,26],[2,19,2,23],[2,24,2,26],[3,19,3,23],[3,24,3,26],[4,19,4,23],[4,24,4,26],[5,19,5,23],[5,24,5,26],[6,19,6,23],[6,24,6,26],[4,10,4,14],[7,19,7,23],[7,24,7,26],[9,22,9,24],[0,27,0,32],[1,27,1,32],[3,28,3,30],[6,28,6,30]]}
["15 Team Bracket",null,null,null,null,null,null,null,null,{"$f":"A1","v":"15 Team Bracket"},null,null,null,null,null,null,null,null,{"$f":"J1","v":"15 Team Bracket"},null,null,null,null,null,null,null,null,{"$f":"A1","v":"15 Team Bracket"}]
["Pool A",null,null,null,null,null,null,null,null,"Pool B",null,null,null,null,null,null,null,null,"Pool C",null,null,null,null,null,null,null,null,"Playoffs"]
["Team","Name",null,null,null,null,"Contact",null,null,"Team","Name",null,null,null,null,"Contact",null,null,"Team","Name",null,null,null,null,"Contact"]
[1,"Pool A1",null,null,null,null,null,null,null,1,"Pool B1",null,null,null,null,null,null,null,1,"Pool C1",null,null,null,null,null,null,null,"Game","Semi-Final Game",null,null,"Court","Time"]
[2,"Pool A2",null,null,null,null,null,null,null,2,"Pool B2",null,null,null,null,null,null,null,2,"Pool C2",null,null,null,null,null,null,null,31,"#2 Seeded Pool Winner","vs.","#3 Seeded Pool Winner"]
[3,"Pool A3",null,null,null,null,null,null,null,3,"Pool B3",null,null,null,null,null,null,null,3,"Pool C3"]
[4,"Pool A4",null,null,null,null,null,null,null,4,"Pool B4",null,null,null,null,null,null,null,4,"Pool C4",null,null,null,null,null,null,null,"Game","Championship Game",null,null,"Court","Time"]
[5,"Pool A5",null,null,null,null,null,null,null,5,"Pool B5",null,null,null,null,null,null,null,5,"Pool C5",null,null,null,null,null,null,null,32,"#1 Seeded Pool Winner","vs.","Winner of Game 31"]
[]
["Game",null,null,null,"Teams",null,null,"Court","Time","Game",null,null,null,"Teams",null,null,"Court","Time","Game",null,null,null,"Teams",null,null,"Court","Time"]
[1,1,"vs.",4,{"$f":"CONCATENATE((IF($A$4=B11,$B$4,IF($A$5=B11,$B$5,IF($A$6=B11,$B$6,IF($A$7=B11,$B$7,IF($A$8=B11,$B$8)))))))","v":"Pool A1"},"vs.",{"$f":"CONCATENATE((IF($A$4=D11,$B$4,IF($A$5=D11,$B$5,IF($A$6=D11,$B$6,IF($A$7=D11,$B$7,IF($A$8=D11,$B$8)))))))","v":"Pool A4"},null,null,11,1,"vs.",4,{"$f":"CONCATENATE((IF($J$4=K11,$K$4,IF($J$5=K11,$K$5,IF($J$6=K11,$K$6,IF($J$7=K11,$K$7,IF($J$8=K11,$K$8)))))))","v":"Pool B1"},"vs.",{"$f":"CONCATENATE((IF($J$4=M11,$K$4,IF($J$5=M11,$K$5,IF($J$6=M11,$K$6,IF($J$7=M11,$K$7,IF($J$8=M11,$K$8)))))))","v":"Pool B4"},null,null,21,1,"vs.",4,{"$f":"CONCATENATE((IF($S$4=T11,$T$4,IF($S$5=T11,$T$5,IF($S$6=T11,$T$6,IF($S$7=T11,$T$7,IF($S$8=T11,$T$8)))))))","v":"Pool C1"},"vs.",{"$f":"CONCATENATE((IF($S$4=V11,$T$4,IF($S$5=V11,$T$5,IF($S$6=V11,$T$6,IF($S$7=V11,$T$7,IF($S$8=V11,$T$8)))))))","v":"Pool C4"}]
[2,2,"vs.",3,{"$f":"CONCATENATE((IF($A$4=B12,$B$4,IF($A$5=B12,$B$5,IF($A$6=B12,$B$6,IF($A$7=B12,$B$7,IF($A$8=B12,$B$8)))))))","v":"Pool A2"},"vs.",{"$f":"CONCATENATE((IF($A$4=D12,$B$4,IF($A$5=D12,$B$5,IF($A$6=D12,$B$6,IF($A$7=D12,$B$7,IF($A$8=D12,$B$8)))))))","v":"Pool A3"},null,null,12,2,"vs.",3,"Pool B2","vs.",{"$f":"CONCATENATE((IF($J$4=M12,$K$4,IF($J$5=M12,$K$5,IF($J$6=M12,$K$6,IF($J$7=M12,$K$7,IF($J$8=M12,$K$8)))))))","v":"Pool B3"},null,null,22,2,"vs.",3,{"$f":"CONCATENATE((IF($S$4=T12,$T$4,IF($S$5=T12,$T$5,IF($S$6=T12,$T$6,IF($S$7=T12,$T$7,IF($S$8=T12,$T$8)))))))","v":"Pool C2"},"vs.",{"$f":"CONCATENATE((IF($S$4=V12,$T$4,IF($S$5=V12,$T$5,IF($S$6=V12,$T$6,IF($S$7=V12,$T$7,IF($S$8=V12,$T$8)))))))","v":"Pool C3"}]
[3,1,"vs.",3,"Pool A1","vs.","Pool A3",null,null,13,1,"vs.",3,"Pool B1","vs.","Pool B3",null,null,23,1,"vs.",3,"Pool C1","vs.","Pool C3"]
[4,4,"vs.",5,"Pool A4","vs.","Pool A5",null,null,14,4,"vs.",5,"Pool B4","vs.","Pool B5",null,null,24,4,"vs.",5,"Pool C4","vs.","Pool C5"]
[5,3,"vs.",5,"Pool A3","vs.","Pool A5",null,null,15,3,"vs.",5,"Pool B3","vs.","Pool B5",null,null,25,3,"vs.",5,"Pool C3","vs.","Pool C5"]
[6,1,"vs.",2,"Pool A1","vs.","Pool A2",null,null,16,1,"vs.",2,"Pool B1","vs.","Pool B2",null,null,26,1,"vs.",2,"Pool C1","vs.","Pool C2"]
[7,2,"vs.",5,"Pool A2","vs.","Pool A5",null,null,17,2,"vs.",5,"Pool B2","vs.","Pool B5",null,null,27,2,"vs.",5,"Pool C2","vs.","Pool C5"]
[8,3,"vs.",4,"Pool A3","vs.","Pool A4",null,null,18,3,"vs.",4,"Pool B3","vs.","Pool B4",null,null,28,3,"vs.",4,"Pool C3","vs.","Pool C4"]
[9,2,"vs.",4,"Pool A2","vs.","Pool A4",null,null,19,2,"vs.",4,"Pool B2","vs.","Pool B4",null,null,29,2,"vs.",4,"Pool C2","vs.","Pool C4"]
[10,1,"vs.",5,"Pool A1","vs.","Pool A5",null,null,20,1,"vs.",5,"Pool B1","vs.","Pool B5",null,null,30,1,"vs.",5,"Pool C1","vs.","Pool C5"]

{"sheet":"16 team","index":22,"n_rows":15,"n_cols":42,"rows_kept":15,"cut":false,"hidden":false,"merged":[[0,36,0,41],[1,36,1,41],[3,37,3,39],[0,27,0,35],[1,27,1,35],[7,37,7,39],[2,33,2,35],[3,28,3,32],[3,33,3,35],[4,28,4,32],[4,33,4,35],[5,28,5,32],[5,33,5,35],[2,28,2,32],[6,28,6,32],[6,33,6,35],[6,24,6,26],[5,1,5,5],[5,6,5,8],[5,10,5,14],[5,15,5,17],[5,19,5,23],[5,24,5,26],[6,1,6,5],[6,6,6,8],[6,10,6,14],[6,15,6,17],[6,19,6,23],[4,24,4,26],[3,1,3,5],[3,6,3,8],[3,10,3,14],[3,15,3,17],[3,19,3,23],[3,24,3,26],[4,1,4,5],[4,6,4,8],[4,10,4,14],[4,15,4,17],[4,19,4,23],[2,24,2,26],[0,0,0,8],[0,9,0,17],[0,18,0,26],[1,0,1,8],[1,9,1,17],[1,18,1,26],[2,1,2,5],[2,6,2,8],[2,10,2,14],[2,15,2,17],[2,19,2,23]]}
["16 Team Bracket",null,null,null,null,null,null,null,null,{"$f":"A1","v":"16 Team Bracket"},null,null,null,null,null,null,null,null,{"$f":"J1","v":"16 Team Bracket"},null,null,null,null,null,null,null,null,{"$f":"S1","v":"16 Team Bracket"},null,null,null,null,null,null,null,null,{"$f":"A1","v":"16 Team Bracket"}]
["Pool A",null,null,null,null,null,null,null,null,"Pool B",null,null,null,null,null,null,null,null,"Pool C",null,null,null,null,null,null,null,null,"Pool D",null,null,null,null,null,null,null,null,"Playoffs"]
["Team","Name",null,null,null,null,"Contact",null,null,"Team","Name",null,null,null,null,"Contact",null,null,"Team","Name",null,null,null,null,"Contact",null,null,"Team","Name",null,null,null,null,"Contact"]
[1,"Pool A1",null,null,null,null,null,null,null,1,"Pool B1",null,null,null,null,null,null,null,1,"Pool C1",null,null,null,null,null,null,null,1,"Pool D1",null,null,null,null,null,null,null,"Game","Semi-Final Games",null,null,"Court","Time"]
[2,"Pool A2",null,null,null,null,null,null,null,2,"Pool B2",null,null,null,null,null,null,null,2,"Pool C2",null,null,null,null,null,null,null,2,"Pool D2",null,null,null,null,null,null,null,25,"Pool A #1 Seed","vs.","Pool B #1 Seed"]
[3,"Pool A3",null,null,null,null,null,null,null,3,"Pool B3",null,null,null,null,null,null,null,3,"Pool C3",null,null,null,null,null,null,null,3,"Pool D3",null,null,null,null,null,null,null,26,"Pool C #1 Seed","vs.","Pool D #1 Seed"]
[4,"Pool A4",null,null,null,null,null,null,null,4,"Pool B4",null,null,null,null,null,null,null,4,"Pool C4",null,null,null,null,null,null,null,4,"Pool D4"]
[null,null,null,null,null,null,null,null,null,null,null,null,null,null,null,null,null,null,null,null,null,null,null,null,null,null,null,null,null,null,null,null,null,null,null,null,"Game","Championship Game",null,null,"Court","Time"]
["Game",null,null,null,"Teams",null,null,"Court","Time","Game",null,null,null,"Teams",null,null,"Court","Time","Game",null,null,null,"Teams",null,null,"Court","Time","Game",null,null,null,"Teams",null,null,"Court","Time",27,"Winner Game 25","vs.","Winner Game 26"]
[1,1,"vs.",2,{"$f":"CONCATENATE((IF($A$4=B10,$B$4,IF($A$5=B10,$B$5,IF($A$6=B10,$B$6,IF($A$7=B10,$B$7))))))","v":"Pool A1"},"vs.",{"$f":"CONCATENATE(IF($A$4=D10,$B$4,IF($A$5=D10,$B$5,IF($A$6=D10,$B$6,IF($A$7=D10,$B$7)))))","v":"Pool A2"},null,null,7,1,"vs.",2,{"$f":"CONCATENATE((IF($J$4=K10,$K$4,IF($J$5=K10,$K$5,IF($J$6=K10,$K$6,IF($J$7=K10,$K$7))))))","v":"Pool B1"},"vs.",{"$f":"CONCATENATE((IF($J$4=M10,$K$4,IF($J$5=M10,$K$5,IF($J$6=M10,$K$6,IF($J$7=M10,$K$7))))))","v":"Pool B2"},null,null,13,1,"vs.",2,{"$f":"CONCATENATE((IF($S$4=T10,$T$4,IF($S$5=T10,$T$5,IF($S$6=T10,$T$6,IF($S$7=T10,$T$7))))))","v":"Pool C1"},"vs.",{"$f":"CONCATENATE((IF($S$4=V10,$T$4,IF($S$5=V10,$T$5,IF($S$6=V10,$T$6,IF($S$7=V10,$T$7))))))","v":"Pool C2"},null,null,19,1,"vs.",2,{"$f":"CONCATENATE((IF($AB$4=AC10,$AC$4,IF($AB$5=AC10,$AC$5,IF($AB$6=AC10,$AC$6,IF($AB$7=AC10,$AC$7))))))","v":"Pool D1"},"vs.",{"$f":"CONCATENATE((IF($AB$4=AE10,$AC$4,IF($AB$5=AE10,$AC$5,IF($AB$6=AE10,$AC$6,IF($AB$7=AE10,$AC$7))))))","v":"Pool D2"}]
[2,3,"vs.",4,{"$f":"CONCATENATE((IF($A$4=B11,$B$4,IF($A$5=B11,$B$5,IF($A$6=B11,$B$6,IF($A$7=B11,$B$7))))))","v":"Pool A3"},"vs.",{"$f":"CONCATENATE(IF($A$4=D11,$B$4,IF($A$5=D11,$B$5,IF($A$6=D11,$B$6,IF($A$7=D11,$B$7)))))","v":"Pool A4"},null,null,8,3,"vs.",4,{"$f":"CONCATENATE((IF($J$4=K11,$K$4,IF($J$5=K11,$K$5,IF($J$6=K11,$K$6,IF($J$7=K11,$K$7))))))","v":"Pool B3"},"vs.",{"$f":"CONCATENATE((IF($J$4=M11,$K$4,IF($J$5=M11,$K$5,IF($J$6=M11,$K$6,IF($J$7=M11,$K$7))))))","v":"Pool B4"},null,null,14,3,"vs.",4,{"$f":"CONCATENATE((IF($S$4=T11,$T$4,IF($S$5=T11,$T$5,IF($S$6=T11,$T$6,IF($S$7=T11,$T$7))))))","v":"Pool C3"},"vs.",{"$f":"CONCATENATE((IF($S$4=V11,$T$4,IF($S$5=V11,$T$5,IF($S$6=V11,$T$6,IF($S$7=V11,$T$7))))))","v":"Pool C4"},null,null,20,3,"vs.",4,{"$f":"CONCATENATE((IF($AB$4=AC11,$AC$4,IF($AB$5=AC11,$AC$5,IF($AB$6=AC11,$AC$6,IF($AB$7=AC11,$AC$7))))))","v":"Pool D3"},"vs.",{"$f":"CONCATENATE((IF($AB$4=AE11,$AC$4,IF($AB$5=AE11,$AC$5,IF($AB$6=AE11,$AC$6,IF($AB$7=AE11,$AC$7))))))","v":"Pool D4"}]
[3,1,"vs.",3,"Pool A1","vs.","Pool A3",null,null,9,1,"vs.",3,"Pool B1","vs.","Pool B3",null,null,15,1,"vs.",3,"Pool C1","vs.","Pool C3",null,null,21,1,"vs.",3,"Pool D1","vs.","Pool D3"]
[4,2,"vs.",4,"Pool A2","vs.","Pool A4",null,null,10,2,"vs.",4,"Pool B2","vs.","Pool B4",null,null,16,2,"vs.",4,"Pool C2","vs.","Pool C4",null,null,22,2,"vs.",4,"Pool D2","vs.","Pool D4"]
[5,1,"vs.",4,"Pool A1","vs.","Pool A4",null,null,11,1,"vs.",4,"Pool B1","vs.","Pool B4",null,null,17,1,"vs.",4,"Pool C1","vs.","Pool C4",null,null,23,1,"vs.",4,"Pool D1","vs.","Pool D4"]
[6,2,"vs.",3,"Pool A2","vs.","Pool A3",null,null,12,2,"vs.",3,"Pool B2","vs.","Pool B3",null,null,18,2,"vs.",3,"Pool C2","vs.","Pool C3",null,null,24,2,"vs.",3,"Pool D2","vs.","Pool D3"]

{"sheet":"17 team","index":23,"n_rows":20,"n_cols":42,"rows_kept":20,"cut":false,"hidden":false,"merged":[[9,4,9,6],[30,0,30,1],[30,3,30,6],[7,1,7,5],[7,6,7,8],[7,10,7,14],[7,15,7,17],[7,37,7,39],[8,22,8,24],[8,31,8,33],[8,13,8,15],[5,28,5,32],[5,33,5,35],[6,1,6,5],[6,6,6,8],[6,10,6,14],[6,15,6,17],[6,19,6,23],[6,24,6,26],[6,28,6,32],[6,33,6,35],[5,1,5,5],[5,6,5,8],[5,10,5,14],[5,15,5,17],[5,19,5,23],[5,24,5,26],[3,37,3,39],[4,1,4,5],[4,6,4,8],[4,10,4,14],[4,15,4,17],[4,19,4,23],[4,24,4,26],[4,28,4,32],[4,33,4,35],[2,28,2,32],[2,33,2,35],[3,1,3,5],[3,6,3,8],[3,10,3,14],[3,15,3,17],[3,19,3,23],[3,24,3,26],[3,28,3,32],[3,33,3,35],[2,1,2,5],[2,6,2,8],[2,10,2,14],[2,15,2,17],[2,19,2,23],[2,24,2,26],[0,0,0,8],[0,9,0,17],[0,18,0,26],[0,27,0,35],[0,36,0,41],[1,0,1,8],[1,9,1,17],[1,18,1,26],[1,27,1,35],[1,36,1,41]]}
["17 Team Bracket",null,null,null,null,null,null,null,null,{"$f":"A1","v":"17 Team Bracket"},null,null,null,null,null,null,null,null,{"$f":"A1","v":"17 Team Bracket"},null,null,null,null,null,null,null,null,{"$f":"J1","v":"17 Team Bracket"},null,null,null,null,null,null,null,null,{"$f":"A1","v":"17 Team Bracket"}]
["Pool A",null,null,null,null,null,null,null,null,"Pool B",null,null,null,null,null,null,null,null,"Pool C",null,null,null,null,null,null,null,null,"Pool D",null,null,null,null,null,null,null,null,"Playoffs"]
["Team","Name",null,null,null,null,"Contact",null,null,"Team","Name",null,null,null,null,"Contact",null,null,"Team","Name",null,null,null,null,"Contact",null,null,"Team","Name",null,null,null,null,"Contact"]
[1,"Pool A1",null,null,null,null,null,null,null,1,"Pool B1",null,null,null,null,null,null,null,1,"Pool C1",null,null,null,null,null,null,null,1,"Pool D1",null,null,null,null,null,null,null,"Game","Semi-Final Games",null,null,"Court","Time"]
[2,"Pool A2",null,null,null,null,null,null,null,2,"Pool B2",null,null,null,null,null,null,null,2,"Pool C2",null,null,null,null,null,null,null,2,"Pool D2",null,null,null,null,null,null,null,29,"Pool A #1 Seed","vs.","Pool B #1 Seed"]
[3,"Pool A3",null,null,null,null,null,null,null,3,"Pool B3",null,null,null,null,null,null,null,3,"Pool C3",null,null,null,null,null,null,null,3,"Pool D3",null,null,null,null,null,null,null,30,"Pool C #1 Seed","vs.","Pool D #1 Seed"]
[4,"Pool A4",null,null,null,null,null,null,null,4,"Pool B4",null,null,null,null,null,null,null,4,"Pool C4",null,null,null,null,null,null,null,4,"Pool D4"]
[5,"Pool A5",null,null,null,null,null,null,null,null,null,null,null,null,null,null,null,null,null,null,null,null,null,null,null,null,null,null,null,null,null,null,null,null,null,null,"Game","Championship Game",null,null,"Court","Time"]
[null,null,null,null,null,null,null,null,null,"Game",null,null,null,"Teams",null,null,"Court","Time","Game",null,null,null,"Teams",null,null,"Court","Time","Game",null,null,null,"Teams",null,null,"Court","Time",31,"Winner Game 29","vs.","Winner Game 30"]
["Game",null,null,null,"Teams",null,null,"Court","Time",11,1,"vs.",2,{"$f":"CONCATENATE((IF($J$4=K10,$K$4,IF($J$5=K10,$K$5,IF($J$6=K10,$K$6,IF($J$7=K10,$K$7,IF($J$8=K10,$K$8)))))))","v":"Pool B1"},"vs.",{"$f":"CONCATENATE((IF($J$4=M10,$K$4,IF($J$5=M10,$K$5,IF($J$6=M10,$K$6,IF($J$7=M10,$K$7,IF($J$8=M10,$K$8)))))))","v":"Pool B2"},null,null,17,1,"vs.",2,{"$f":"CONCATENATE((IF($S$4=T10,$T$4,IF($S$5=T10,$T$5,IF($S$6=T10,$T$6,IF($S$7=T10,$T$7,\"?\"))))))","v":"Pool C1"},"vs.",{"$f":"CONCATENATE((IF($S$4=V10,$T$4,IF($S$5=V10,$T$5,IF($S$6=V10,$T$6,IF($S$7=V10,$T$7,\"?\"))))))","v":"Pool C2"},null,null,23,1,"vs.",2,{"$f":"CONCATENATE((IF($AB$4=AC10,$AC$4,IF($AB$5=AC10,$AC$5,IF($AB$6=AC10,$AC$6,IF($AB$7=AC10,$AC$7,\"?\"))))))","v":"Pool D1"},"vs.",{"$f":"CONCATENATE((IF($AB$4=AE10,$AC$4,IF($AB$5=AE10,$AC$5,IF($AB$6=AE10,$AC$6,IF($AB$7=AE10,$AC$7,\"?\"))))))","v":"Pool D2"}]
[1,1,"vs.",4,{"$f":"CONCATENATE((IF($A$4=B11,$B$4,IF($A$5=B11,$B$5,IF($A$6=B11,$B$6,IF($A$7=B11,$B$7,IF($A$8=B11,$B$8)))))))","v":"Pool A1"},"vs.",{"$f":"CONCATENATE((IF($A$4=D11,$B$4,IF($A$5=D11,$B$5,IF($A$6=D11,$B$6,IF($A$7=D11,$B$7,IF($A$8=D11,$B$8)))))))","v":"Pool A4"},null,null,12,3,"vs.",4,"Pool B3","vs.","Pool B4",null,null,18,3,"vs.",4,{"$f":"CONCATENATE((IF($S$4=T11,$T$4,IF($S$5=T11,$T$5,IF($S$6=T11,$T$6,IF($S$7=T11,$T$7,\"?\"))))))","v":"Pool C3"},"vs.","Pool C4",null,null,24,3,"vs.",4,{"$f":"CONCATENATE((IF($AB$4=AC11,$AC$4,IF($AB$5=AC11,$AC$5,IF($AB$6=AC11,$AC$6,IF($AB$7=AC11,$AC$7,\"?\"))))))","v":"Pool D3"},"vs.",{"$f":"CONCATENATE((IF($AB$4=AE11,$AC$4,IF($AB$5=AE11,$AC$5,IF($AB$6=AE11,$AC$6,IF($AB$7=AE11,$AC$7,\"?\"))))))","v":"Pool D4"}]
[2,2,"vs.",3,{"$f":"CONCATENATE((IF($A$4=B12,$B$4,IF($A$5=B12,$B$5,IF($A$6=B12,$B$6,IF($A$7=B12,$B$7,IF($A$8=B12,$B$8)))))))","v":"Pool A2"},"vs.",{"$f":"CONCATENATE((IF($A$4=D12,$B$4,IF($A$5=D12,$B$5,IF($A$6=D12,$B$6,IF($A$7=D12,$B$7,IF($A$8=D12,$B$8)))))))","v":"Pool A3"},null,null,13,1,"vs.",3,"Pool B1","vs.","Pool B3",null,null,19,1,"vs.",3,"Pool C1","vs.","Pool C3",null,null,25,1,"vs.",3,"Pool D1","vs.","Pool D3"]
[3,1,"vs.",3,"Pool A1","vs.","Pool A3",null,null,14,2,"vs.",4,"Pool B2","vs.","Pool B4",null,null,20,2,"vs.",4,"Pool C2","vs.","Pool C4",null,null,26,2,"vs.",4,"Pool D2","vs.","Pool D4"]
[4,4,"vs.",5,"Pool A4","vs.","Pool A5",null,null,15,1,"vs.",4,"Pool B1","vs.","Pool B4",null,null,21,1,"vs.",4,"Pool C1","vs.","Pool C4",null,null,27,1,"vs.",4,"Pool D1","vs.","Pool D4"]
[5,3,"vs.",5,"Pool A3","vs.","Pool A5",null,null,16,2,"vs.",3,"Pool B2","vs.","Pool B3",null,null,22,2,"vs.",3,"Pool C2","vs.","Pool C3",null,null,28,2,"vs.",3,"Pool D2","vs.","Pool D3"]
[6,1,"vs.",2,"Pool A1","vs.","Pool A2"]
[7,2,"vs.",5,"Pool A2","vs.","Pool A5"]
[8,3,"vs.",4,"Pool A3","vs.","Pool A4"]
[9,2,"vs.",4,"Pool A2","vs.","Pool A4"]
[10,1,"vs.",5,"Pool A1","vs.","Pool A5"]

{"sheet":"18 team","index":24,"n_rows":20,"n_cols":42,"rows_kept":20,"cut":false,"hidden":false,"merged":[[7,1,7,5],[7,6,7,8],[9,4,9,6],[30,0,30,1],[30,3,30,6],[4,1,4,5],[4,6,4,8],[5,1,5,5],[5,6,5,8],[6,1,6,5],[6,6,6,8],[0,0,0,8],[1,0,1,8],[2,1,2,5],[2,6,2,8],[3,1,3,5],[3,6,3,8],[0,9,0,17],[1,9,1,17],[2,10,2,14],[2,15,2,17],[3,10,3,14],[3,15,3,17],[4,10,4,14],[4,15,4,17],[5,10,5,14],[5,15,5,17],[6,10,6,14],[6,15,6,17],[4,19,4,23],[4,24,4,26],[5,19,5,23],[5,24,5,26],[6,19,6,23],[6,24,6,26],[0,18,0,26],[1,18,1,26],[2,19,2,23],[2,24,2,26],[3,19,3,23],[3,24,3,26],[6,33,6,35],[8,31,8,33],[7,10,7,14],[7,15,7,17],[9,13,9,15],[0,36,0,41],[1,36,1,41],[3,37,3,39],[7,37,7,39],[8,22,8,24],[0,27,0,35],[1,27,1,35],[2,28,2,32],[2,33,2,35],[3,28,3,32],[3,33,3,35],[4,28,4,32],[4,33,4,35],[5,28,5,32],[5,33,5,35],[6,28,6,32]]}
["18 Team Bracket",null,null,null,null,null,null,null,null,{"$f":"A1","v":"18 Team Bracket"},null,null,null,null,null,null,null,null,{"$f":"A1","v":"18 Team Bracket"},null,null,null,null,null,null,null,null,{"$f":"J1","v":"18 Team Bracket"},null,null,null,null,null,null,null,null,{"$f":"A1","v":"18 Team Bracket"}]
["Pool A",null,null,null,null,null,null,null,null,"Pool B",null,null,null,null,null,null,null,null,"Pool C",null,null,null,null,null,null,null,null,"Pool D",null,null,null,null,null,null,null,null,"Playoffs"]
["Team","Name",null,null,null,null,"Contact",null,null,"Team","Name",null,null,null,null,"Contact",null,null,"Team","Name",null,null,null,null,"Contact",null,null,"Team","Name",null,null,null,null,"Contact"]
[1,"Pool A1",null,null,null,null,null,null,null,1,"Pool B1",null,null,null,null,null,null,null,1,"Pool C1",null,null,null,null,null,null,null,1,"Pool D1",null,null,null,null,null,null,null,"Game","Semi-Final Games",null,null,"Court","Time"]
[2,"Pool A2",null,null,null,null,null,null,null,2,"Pool B2",null,null,null,null,null,null,null,2,"Pool C2",null,null,null,null,null,null,null,2,"Pool D2",null,null,null,null,null,null,null,33,"Pool A #1 Seed","vs.","Pool B #1 Seed"]
[3,"Pool A3",null,null,null,null,null,null,null,3,"Pool B3",null,null,null,null,null,null,null,3,"Pool C3",null,null,null,null,null,null,null,3,"Pool D3",null,null,null,null,null,null,null,34,"Pool C #1 Seed","vs.","Pool D #1 Seed"]
[4,"Pool A4",null,null,null,null,null,null,null,4,"Pool B4",null,null,null,null,null,null,null,4,"Pool C4",null,null,null,null,null,null,null,4,"Pool D4"]
[5,"Pool A5",null,null,null,null,null,null,null,5,"Pool B5",null,null,null,null,null,null,null,null,null,null,null,null,null,null,null,null,null,null,null,null,null,null,null,null,null,"Game","Championship Game",null,null,"Court","Time"]
[null,null,null,null,null,null,null,null,null,null,null,null,null,null,null,null,null,null,"Game",null,null,null,"Teams",null,null,"Court","Time","Game",null,null,null,"Teams",null,null,"Court","Time",35,"Winner Game 33","vs.","Winner Game 34"]
["Game",null,null,null,"Teams",null,null,"Court","Time","Game",null,null,null,"Teams",null,null,"Court","Time",21,1,"vs.",2,{"$f":"CONCATENATE((IF($S$4=T10,$T$4,IF($S$5=T10,$T$5,IF($S$6=T10,$T$6,IF($S$7=T10,$T$7,\"?\"))))))","v":"Pool C1"},"vs.",{"$f":"CONCATENATE((IF($S$4=V10,$T$4,IF($S$5=V10,$T$5,IF($S$6=V10,$T$6,IF($S$7=V10,$T$7,\"?\"))))))","v":"Pool C2"},null,null,27,1,"vs.",2,{"$f":"CONCATENATE((IF($AB$4=AC10,$AC$4,IF($AB$5=AC10,$AC$5,IF($AB$6=AC10,$AC$6,IF($AB$7=AC10,$AC$7,\"?\"))))))","v":"Pool D1"},"vs.",{"$f":"CONCATENATE((IF($AB$4=AE10,$AC$4,IF($AB$5=AE10,$AC$5,IF($AB$6=AE10,$AC$6,IF($AB$7=AE10,$AC$7,\"?\"))))))","v":"Pool D2"}]
[1,1,"vs.",4,{"$f":"CONCATENATE((IF($A$4=B11,$B$4,IF($A$5=B11,$B$5,IF($A$6=B11,$B$6,IF($A$7=B11,$B$7,IF($A$8=B11,$B$8)))))))","v":"Pool A1"},"vs.",{"$f":"CONCATENATE((IF($A$4=D11,$B$4,IF($A$5=D11,$B$5,IF($A$6=D11,$B$6,IF($A$7=D11,$B$7,IF($A$8=D11,$B$8)))))))","v":"Pool A4"},null,null,11,1,"vs.",4,{"$f":"CONCATENATE((IF($J$4=K11,$K$4,IF($J$5=K11,$K$5,IF($J$6=K11,$K$6,IF($J$7=K11,$K$7,IF($J$8=K11,$K$8)))))))","v":"Pool B1"},"vs.",{"$f":"CONCATENATE((IF($J$4=M11,$K$4,IF($J$5=M11,$K$5,IF($J$6=M11,$K$6,IF($J$7=M11,$K$7,IF($J$8=M11,$K$8)))))))","v":"Pool B4"},null,null,22,3,"vs.",4,{"$f":"CONCATENATE((IF($S$4=T11,$T$4,IF($S$5=T11,$T$5,IF($S$6=T11,$T$6,IF($S$7=T11,$T$7,\"?\"))))))","v":"Pool C3"},"vs.","Pool C4",null,null,28,3,"vs.",4,{"$f":"CONCATENATE((IF($AB$4=AC11,$AC$4,IF($AB$5=AC11,$AC$5,IF($AB$6=AC11,$AC$6,IF($AB$7=AC11,$AC$7,\"?\"))))))","v":"Pool D3"},"vs.",{"$f":"CONCATENATE((IF($AB$4=AE11,$AC$4,IF($AB$5=AE11,$AC$5,IF($AB$6=AE11,$AC$6,IF($AB$7=AE11,$AC$7,\"?\"))))))","v":"Pool D4"}]
[2,2,"vs.",3,{"$f":"CONCATENATE((IF($A$4=B12,$B$4,IF($A$5=B12,$B$5,IF($A$6=B12,$B$6,IF($A$7=B12,$B$7,IF($A$8=B12,$B$8)))))))","v":"Pool A2"},"vs.",{"$f":"CONCATENATE((IF($A$4=D12,$B$4,IF($A$5=D12,$B$5,IF($A$6=D12,$B$6,IF($A$7=D12,$B$7,IF($A$8=D12,$B$8)))))))","v":"Pool A3"},null,null,12,2,"vs.",3,{"$f":"CONCATENATE((IF($J$4=K12,$K$4,IF($J$5=K12,$K$5,IF($J$6=K12,$K$6,IF($J$7=K12,$K$7,IF($J$8=K12,$K$8)))))))","v":"Pool B2"},"vs.",{"$f":"CONCATENATE((IF($J$4=M12,$K$4,IF($J$5=M12,$K$5,IF($J$6=M12,$K$6,IF($J$7=M12,$K$7,IF($J$8=M12,$K$8)))))))","v":"Pool B3"},null,null,23,1,"vs.",3,"Pool C1","vs.","Pool C3",null,null,29,1,"vs.",3,"Pool D1","vs.","Pool D3"]
[3,1,"vs.",3,"Pool A1","vs.","Pool A3",null,null,13,1,"vs.",3,"Pool B1","vs.","Pool B3",null,null,24,2,"vs.",4,"Pool C2","vs.","Pool C4",null,null,30,2,"vs.",4,"Pool D2","vs.","Pool D4"]
[4,4,"vs.",5,"Pool A4","vs.","Pool A5",null,null,14,4,"vs.",5,"Pool B4","vs.","Pool B5",null,null,25,1,"vs.",4,"Pool C1","vs.","Pool C4",null,null,31,1,"vs.",4,"Pool D1","vs.","Pool D4"]
[5,3,"vs.",5,"Pool A3","vs.","Pool A5",null,null,15,3,"vs.",5,"Pool B3","vs.","Pool B5",null,null,26,2,"vs.",3,"Pool C2","vs.","Pool C3",null,null,32,2,"vs.",3,"Pool D2","vs.","Pool D3"]
[6,1,"vs.",2,"Pool A1","vs.","Pool A2",null,null,16,1,"vs.",2,"Pool B1","vs.","Pool B2"]
[7,2,"vs.",5,"Pool A2","vs.","Pool A5",null,null,17,2,"vs.",5,"Pool B2","vs.","Pool B5"]
[8,3,"vs.",4,"Pool A3","vs.","Pool A4",null,null,18,3,"vs.",4,"Pool B3","vs.","Pool B4"]
[9,2,"vs.",4,"Pool A2","vs.","Pool A4",null,null,19,2,"vs.",4,"Pool B2","vs.","Pool B4"]
[10,1,"vs.",5,"Pool A1","vs.","Pool A5",null,null,20,1,"vs.",5,"Pool B1","vs.","Pool B5"]

{"sheet":"19 Team","index":25,"n_rows":20,"n_cols":42,"rows_kept":20,"cut":false,"hidden":false,"merged":[[5,1,5,5],[5,6,5,8],[7,1,7,5],[7,6,7,8],[6,1,6,5],[6,6,6,8],[0,0,0,8],[0,9,0,17],[0,18,0,26],[0,27,0,35],[0,36,0,41],[1,36,1,41],[2,1,2,5],[2,6,2,8],[2,10,2,14],[2,15,2,17],[2,19,2,23],[2,24,2,26],[2,28,2,32],[2,33,2,35],[1,0,1,8],[1,9,1,17],[1,18,1,26],[1,27,1,35],[3,37,3,39],[4,1,4,5],[4,6,4,8],[4,10,4,14],[4,15,4,17],[4,19,4,23],[4,24,4,26],[4,28,4,32],[4,33,4,35],[3,10,3,14],[3,15,3,17],[3,19,3,23],[3,24,3,26],[3,28,3,32],[3,1,3,5],[3,6,3,8],[5,33,5,35],[6,24,6,26],[6,28,6,32],[6,33,6,35],[3,33,3,35],[5,10,5,14],[5,15,5,17],[5,19,5,23],[5,24,5,26],[5,28,5,32],[6,10,6,14],[6,15,6,17],[6,19,6,23],[7,37,7,39],[8,31,8,33],[7,24,7,26],[30,0,30,1],[30,3,30,6],[7,19,7,23],[9,22,9,24],[7,10,7,14],[7,15,7,17],[9,4,9,6],[9,13,9,15]]}
["19 Team Bracket",null,null,null,null,null,null,null,null,{"$f":"A1","v":"19 Team Bracket"},null,null,null,null,null,null,null,null,{"$f":"J1","v":"19 Team Bracket"},null,null,null,null,null,null,null,null,{"$f":"J1","v":"19 Team Bracket"},null,null,null,null,null,null,null,null,{"$f":"A1","v":"19 Team Bracket"}]
["Pool A",null,null,null,null,null,null,null,null,"Pool B",null,null,null,null,null,null,null,null,"Pool C",null,null,null,null,null,null,null,null,"Pool D",null,null,null,null,null,null,null,null,"Playoffs"]
["Team","Name",null,null,null,null,"Contact",null,null,"Team","Name",null,null,null,null,"Contact",null,null,"Team","Name",null,null,null,null,"Contact",null,null,"Team","Name",null,null,null,null,"Contact"]
[1,"Pool A1",null,null,null,null,null,null,null,1,"Pool B1",null,null,null,null,null,null,null,1,"Pool C1",null,null,null,null,null,null,null,1,"Pool D1",null,null,null,null,null,null,null,"Game","Semi-Final Games",null,null,"Court","Time"]
[2,"Pool A2",null,null,null,null,null,null,null,2,"Pool B2",null,null,null,null,null,null,null,2,"Pool C2",null,null,null,null,null,null,null,2,"Pool D2",null,null,null,null,null,null,null,37,"Pool A #1 Seed","vs.","Pool B #1 Seed"]
[3,"Pool A3",null,null,null,null,null,null,null,3,"Pool B3",null,null,null,null,null,null,null,3,"Pool C3",null,null,null,null,null,null,null,3,"Pool D3",null,null,null,null,null,null,null,38,"Pool C #1 Seed","vs.","Pool D #1 Seed"]
[4,"Pool A4",null,null,null,null,null,null,null,4,"Pool B4",null,null,null,null,null,null,null,4,"Pool C4",null,null,null,null,null,null,null,4,"Pool D4"]
[5,"Pool A5",null,null,null,null,null,null,null,5,"Pool B5",null,null,null,null,null,null,null,5,"Pool C5",null,null,null,null,null,null,null,null,null,null,null,null,null,null,null,null,"Game","Championship Game",null,null,"Court","Time"]
[null,null,null,null,null,null,null,null,null,null,null,null,null,null,null,null,null,null,null,null,null,null,null,null,null,null,null,"Game",null,null,null,"Teams",null,null,"Court","Time",39,"Winner Game 33","vs.","Winner Game 34"]
["Game",null,null,null,"Teams",null,null,"Court","Time","Game",null,null,null,"Teams",null,null,"Court","Time","Game",null,null,null,"Teams",null,null,"Court","Time",31,1,"vs.",2,{"$f":"CONCATENATE((IF($AB$4=AC10,$AC$4,IF($AB$5=AC10,$AC$5,IF($AB$6=AC10,$AC$6,IF($AB$7=AC10,$AC$7,\"?\"))))))","v":"Pool D1"},"vs.",{"$f":"CONCATENATE((IF($AB$4=AE10,$AC$4,IF($AB$5=AE10,$AC$5,IF($AB$6=AE10,$AC$6,IF($AB$7=AE10,$AC$7,\"?\"))))))","v":"Pool D2"}]
[1,1,"vs.",4,{"$f":"CONCATENATE((IF($A$4=B11,$B$4,IF($A$5=B11,$B$5,IF($A$6=B11,$B$6,IF($A$7=B11,$B$7,IF($A$8=B11,$B$8)))))))","v":"Pool A1"},"vs.",{"$f":"CONCATENATE((IF($A$4=D11,$B$4,IF($A$5=D11,$B$5,IF($A$6=D11,$B$6,IF($A$7=D11,$B$7,IF($A$8=D11,$B$8)))))))","v":"Pool A4"},null,null,11,1,"vs.",4,{"$f":"CONCATENATE((IF($J$4=K11,$K$4,IF($J$5=K11,$K$5,IF($J$6=K11,$K$6,IF($J$7=K11,$K$7,IF($J$8=K11,$K$8)))))))","v":"Pool B1"},"vs.",{"$f":"CONCATENATE((IF($J$4=M11,$K$4,IF($J$5=M11,$K$5,IF($J$6=M11,$K$6,IF($J$7=M11,$K$7,IF($J$8=M11,$K$8)))))))","v":"Pool B4"},null,null,21,1,"vs.",4,{"$f":"CONCATENATE((IF($S$4=T11,$T$4,IF($S$5=T11,$T$5,IF($S$6=T11,$T$6,IF($S$7=T11,$T$7,IF($S$8=T11,$T$8)))))))","v":"Pool C1"},"vs.",{"$f":"CONCATENATE((IF($S$4=V11,$T$4,IF($S$5=V11,$T$5,IF($S$6=V11,$T$6,IF($S$7=V11,$T$7,IF($S$8=V11,$T$8)))))))","v":"Pool C4"},null,null,32,3,"vs.",4,{"$f":"CONCATENATE((IF($AB$4=AC11,$AC$4,IF($AB$5=AC11,$AC$5,IF($AB$6=AC11,$AC$6,IF($AB$7=AC11,$AC$7,\"?\"))))))","v":"Pool D3"},"vs.",{"$f":"CONCATENATE((IF($AB$4=AE11,$AC$4,IF($AB$5=AE11,$AC$5,IF($AB$6=AE11,$AC$6,IF($AB$7=AE11,$AC$7,\"?\"))))))","v":"Pool D4"}]
[2,2,"vs.",3,{"$f":"CONCATENATE((IF($A$4=B12,$B$4,IF($A$5=B12,$B$5,IF($A$6=B12,$B$6,IF($A$7=B12,$B$7,IF($A$8=B12,$B$8)))))))","v":"Pool A2"},"vs.",{"$f":"CONCATENATE((IF($A$4=D12,$B$4,IF($A$5=D12,$B$5,IF($A$6=D12,$B$6,IF($A$7=D12,$B$7,IF($A$8=D12,$B$8)))))))","v":"Pool A3"},null,null,12,2,"vs.",3,{"$f":"CONCATENATE((IF($J$4=K12,$K$4,IF($J$5=K12,$K$5,IF($J$6=K12,$K$6,IF($J$7=K12,$K$7,IF($J$8=K12,$K$8)))))))","v":"Pool B2"},"vs.",{"$f":"CONCATENATE((IF($J$4=M12,$K$4,IF($J$5=M12,$K$5,IF($J$6=M12,$K$6,IF($J$7=M12,$K$7,IF($J$8=M12,$K$8)))))))","v":"Pool B3"},null,null,22,2,"vs.",3,{"$f":"CONCATENATE((IF($S$4=T12,$T$4,IF($S$5=T12,$T$5,IF($S$6=T12,$T$6,IF($S$7=T12,$T$7,IF($S$8=T12,$T$8)))))))","v":"Pool C2"},"vs.",{"$f":"CONCATENATE((IF($S$4=V12,$T$4,IF($S$5=V12,$T$5,IF($S$6=V12,$T$6,IF($S$7=V12,$T$7,IF($S$8=V12,$T$8)))))))","v":"Pool C3"},null,null,33,1,"vs.",3,"Pool D1","vs.","Pool D3"]
[3,1,"vs.",3,"Pool A1","vs.","Pool A3",null,null,13,1,"vs.",3,"Pool B1","vs.","Pool B3",null,null,23,1,"vs.",3,"Pool C1","vs.","Pool C3",null,null,34,2,"vs.",4,"Pool D2","vs.","Pool D4"]
[4,4,"vs.",5,"Pool A4","vs.","Pool A5",null,null,14,4,"vs.",5,"Pool B4","vs.","Pool B5",null,null,24,4,"vs.",5,"Pool C4","vs.","Pool C5",null,null,35,1,"vs.",4,"Pool D1","vs.","Pool D4"]
[5,3,"vs.",5,"Pool A3","vs.","Pool A5",null,null,15,3,"vs.",5,"Pool B3","vs.","Pool B5",null,null,25,3,"vs.",5,"Pool C3","vs.","Pool C5",null,null,36,2,"vs.",3,"Pool D2","vs.","Pool D3"]
[6,1,"vs.",2,"Pool A1","vs.","Pool A2",null,null,16,1,"vs.",2,"Pool B1","vs.","Pool B2",null,null,26,1,"vs.",2,"Pool C1","vs.","Pool C2"]
[7,2,"vs.",5,"Pool A2","vs.","Pool A5",null,null,17,2,"vs.",5,"Pool B2","vs.","Pool B5",null,null,27,2,"vs.",5,"Pool C2","vs.","Pool C5"]
[8,3,"vs.",4,"Pool A3","vs.","Pool A4",null,null,18,3,"vs.",4,"Pool B3","vs.","Pool B4",null,null,28,3,"vs.",4,"Pool C3","vs.","Pool C4"]
[9,2,"vs.",4,"Pool A2","vs.","Pool A4",null,null,19,2,"vs.",4,"Pool B2","vs.","Pool B4",null,null,29,2,"vs.",4,"Pool C2","vs.","Pool C4"]
[10,1,"vs.",5,"Pool A1","vs.","Pool A5",null,null,20,1,"vs.",5,"Pool B1","vs.","Pool B5",null,null,30,1,"vs.",5,"Pool C1","vs.","Pool C5"]

{"sheet":"20 team(5 Pools of 4)","index":26,"n_rows":15,"n_cols":51,"rows_kept":15,"cut":false,"hidden":false,"merged":[[25,0,25,1],[25,3,25,6],[4,1,4,5],[4,6,4,8],[5,1,5,5],[5,6,5,8],[6,1,6,5],[6,6,6,8],[8,4,8,6],[2,1,2,5],[2,6,2,8],[3,1,3,5],[3,6,3,8],[55,3,55,5],[55,6,55,7],[49,3,49,5],[49,6,49,7],[50,3,50,5],[50,6,50,7],[54,3,54,5],[54,6,54,7],[37,0,37,1],[37,3,37,6],[51,3,51,5],[51,6,51,7],[1,9,1,17],[2,10,2,14],[2,15,2,17],[3,10,3,14],[3,15,3,17],[8,13,8,15],[0,0,0,8],[1,0,1,8],[0,18,0,26],[1,18,1,26],[2,19,2,23],[2,24,2,26],[3,19,3,23],[3,24,3,26],[4,10,4,14],[4,15,4,17],[5,10,5,14],[5,15,5,17],[6,10,6,14],[6,15,6,17],[0,9,0,17],[0,27,0,35],[1,27,1,35],[2,28,2,32],[2,33,2,35],[3,28,3,32],[3,33,3,35],[3,37,3,41],[3,42,3,44],[8,22,8,24],[4,28,4,32],[4,33,4,35],[5,28,5,32],[5,33,5,35],[6,28,6,32],[6,33,6,35],[8,31,8,33],[4,19,4,23],[4,24,4,26],[5,19,5,23],[5,24,5,26],[6,19,6,23],[6,24,6,26],[10,46,10,48],[8,40,8,42],[0,45,0,50],[1,45,1,50],[3,46,3,48],[6,46,6,48],[4,37,4,41],[4,42,4,44],[5,37,5,41],[5,42,5,44],[6,37,6,41],[6,42,6,44],[0,36,0,44],[1,36,1,44],[2,37,2,41],[2,42,2,44]]}
["20 Team Bracket (5 Pools of 4)",null,null,null,null,null,null,null,null,{"$f":"A1","v":"20 Team Bracket (5 Pools of 4)"},null,null,null,null,null,null,null,null,{"$f":"A1","v":"20 Team Bracket (5 Pools of 4)"},null,null,null,null,null,null,null,null,{"$f":"A1","v":"20 Team Bracket (5 Pools of 4)"},null,null,null,null,null,null,null,null,{"$f":"A1","v":"20 Team Bracket (5 Pools of 4)"},null,null,null,null,null,null,null,null,{"$f":"A1","v":"20 Team Bracket (5 Pools of 4)"}]
["Pool A",null,null,null,null,null,null,null,null,"Pool B",null,null,null,null,null,null,null,null,"Pool C",null,null,null,null,null,null,null,null,"Pool D",null,null,null,null,null,null,null,null,"Pool E",null,null,null,null,null,null,null,null,"Playoffs"]
["Team","Name",null,null,null,null,"Contact",null,null,"Team","Name",null,null,null,null,"Contact",null,null,"Team","Name",null,null,null,null,"Contact",null,null,"Team","Name",null,null,null,null,"Contact",null,null,"Team","Name",null,null,null,null,"Contact"]
[1,"Pool A1",null,null,null,null,null,null,null,1,"Pool B1",null,null,null,null,null,null,null,1,"Pool C1",null,null,null,null,null,null,null,1,"Pool D1",null,null,null,null,null,null,null,1,"Pool E1",null,null,null,null,null,null,null,"Game","Play-in Game",null,null,"Court","Time"]
[2,"Pool A2",null,null,null,null,null,null,null,2,"Pool B2",null,null,null,null,null,null,null,2,"Pool C2",null,null,null,null,null,null,null,2,"Pool D2",null,null,null,null,null,null,null,2,"Pool E2",null,null,null,null,null,null,null,31,"#4 Seed Pool Winner","vs.","#5 Seed Pool Winner"]
[3,"Pool A3",null,null,null,null,null,null,null,3,"Pool B3",null,null,null,null,null,null,null,3,"Pool C3",null,null,null,null,null,null,null,3,"Pool D3",null,null,null,null,null,null,null,3,"Pool E3"]
[4,"Pool A4",null,null,null,null,null,null,null,4,"Pool B4",null,null,null,null,null,null,null,4,"Pool C4",null,null,null,null,null,null,null,4,"Pool D4",null,null,null,null,null,null,null,4,"Pool E4",null,null,null,null,null,null,null,"Game","Semi-Final Games",null,null,"Court","Time"]
[null,null,null,null,null,null,null,null,null,null,null,null,null,null,null,null,null,null,null,null,null,null,null,null,null,null,null,null,null,null,null,null,null,null,null,null,null,null,null,null,null,null,null,null,null,32,"Winner Game 31","vs.","#1 Seed Pool Winner"]
["Game",null,null,null,"Teams",null,null,"Court","Time","Game",null,null,null,"Teams",null,null,"Court","Time","Game",null,null,null,"Teams",null,null,"Court","Time","Game",null,null,null,"Teams",null,null,"Court","Time","Game",null,null,null,"Teams",null,null,"Court","Time",33,"#2 Seed Pool Winner","vs.","#3 Seed Pool Winner"]
[1,1,"vs.",2,{"$f":"CONCATENATE((IF($A$4=B10,$B$4,IF($A$5=B10,$B$5,IF($A$6=B10,$B$6,IF($A$7=B10,$B$7,\"?\"))))))","v":"Pool A1"},"vs.",{"$f":"CONCATENATE((IF($A$4=D10,$B$4,IF($A$5=D10,$B$5,IF($A$6=D10,$B$6,IF($A$7=D10,$B$7,\"?\"))))))","v":"Pool A2"},null,null,7,1,"vs.",2,{"$f":"CONCATENATE((IF($J$4=K10,$K$4,IF($J$5=K10,$K$5,IF($J$6=K10,$K$6,IF($J$7=K10,$K$7,\"?\"))))))","v":"Pool B1"},"vs.",{"$f":"CONCATENATE((IF($J$4=M10,$K$4,IF($J$5=M10,$K$5,IF($J$6=M10,$K$6,IF($J$7=M10,$K$7,\"?\"))))))","v":"Pool B2"},null,null,13,1,"vs.",2,{"$f":"CONCATENATE((IF($S$4=T10,$T$4,IF($S$5=T10,$T$5,IF($S$6=T10,$T$6,IF($S$7=T10,$T$7,\"?\"))))))","v":"Pool C1"},"vs.",{"$f":"CONCATENATE((IF($S$4=V10,$T$4,IF($S$5=V10,$T$5,IF($S$6=V10,$T$6,IF($S$7=V10,$T$7,\"?\"))))))","v":"Pool C2"},null,null,19,1,"vs.",2,{"$f":"CONCATENATE((IF($AB$4=AC10,$AC$4,IF($AB$5=AC10,$AC$5,IF($AB$6=AC10,$AC$6,IF($AB$7=AC10,$AC$7,\"?\"))))))","v":"Pool D1"},"vs.",{"$f":"CONCATENATE((IF($AB$4=AE10,$AC$4,IF($AB$5=AE10,$AC$5,IF($AB$6=AE10,$AC$6,IF($AB$7=AE10,$AC$7,\"?\"))))))","v":"Pool D2"},null,null,25,1,"vs.",2,{"$f":"CONCATENATE((IF($AK$4=AL10,$AL$4,IF($AK$5=AL10,$AL$5,IF($AK$6=AL10,$AL$6,IF($AK$7=AL10,$AL$7,\"?\"))))))","v":"Pool E1"},"vs.",{"$f":"CONCATENATE((IF($AK$4=AN10,$AL$4,IF($AK$5=AN10,$AL$5,IF($AK$6=AN10,$AL$6,IF($AK$7=AN10,$AL$7,\"?\"))))))","v":"Pool E2"}]
[2,3,"vs.",4,{"$f":"CONCATENATE((IF($A$4=B11,$B$4,IF($A$5=B11,$B$5,IF($A$6=B11,$B$6,IF($A$7=B11,$B$7,\"?\"))))))","v":"Pool A3"},"vs.","Pool A4",null,null,8,3,"vs.",4,{"$f":"CONCATENATE((IF($J$4=K11,$K$4,IF($J$5=K11,$K$5,IF($J$6=K11,$K$6,IF($J$7=K11,$K$7,\"?\"))))))","v":"Pool B3"},"vs.",{"$f":"CONCATENATE((IF($J$4=M11,$K$4,IF($J$5=M11,$K$5,IF($J$6=M11,$K$6,IF($J$7=M11,$K$7,\"?\"))))))","v":"Pool B4"},null,null,14,3,"vs.",4,{"$f":"CONCATENATE((IF($S$4=T11,$T$4,IF($S$5=T11,$T$5,IF($S$6=T11,$T$6,IF($S$7=T11,$T$7,\"?\"))))))","v":"Pool C3"},"vs.",{"$f":"CONCATENATE((IF($S$4=V11,$T$4,IF($S$5=V11,$T$5,IF($S$6=V11,$T$6,IF($S$7=V11,$T$7,\"?\"))))))","v":"Pool C4"},null,null,20,3,"vs.",4,{"$f":"CONCATENATE((IF($AB$4=AC11,$AC$4,IF($AB$5=AC11,$AC$5,IF($AB$6=AC11,$AC$6,IF($AB$7=AC11,$AC$7,\"?\"))))))","v":"Pool D3"},"vs.",{"$f":"CONCATENATE((IF($AB$4=AE11,$AC$4,IF($AB$5=AE11,$AC$5,IF($AB$6=AE11,$AC$6,IF($AB$7=AE11,$AC$7,\"?\"))))))","v":"Pool D4"},null,null,26,3,"vs.",4,{"$f":"CONCATENATE((IF($AK$4=AL11,$AL$4,IF($AK$5=AL11,$AL$5,IF($AK$6=AL11,$AL$6,IF($AK$7=AL11,$AL$7,\"?\"))))))","v":"Pool E3"},"vs.",{"$f":"CONCATENATE((IF($AK$4=AN11,$AL$4,IF($AK$5=AN11,$AL$5,IF($AK$6=AN11,$AL$6,IF($AK$7=AN11,$AL$7,\"?\"))))))","v":"Pool E4"},null,null,"Game","Championship Game",null,null,"Court","Time"]
[3,1,"vs.",3,"Pool A1","vs.","Pool A3",null,null,9,1,"vs.",3,"Pool B1","vs.","Pool B3",null,null,15,1,"vs.",3,"Pool C1","vs.","Pool C3",null,null,21,1,"vs.",3,"Pool D1","vs.","Pool D3",null,null,27,1,"vs.",3,"Pool E1","vs.","Pool E3",null,null,34,"Winner Game 32","vs.","Winner Game 33"]
[4,2,"vs.",4,"Pool A2","vs.","Pool A4",null,null,10,2,"vs.",4,"Pool B2","vs.","Pool B4",null,null,16,2,"vs.",4,"Pool C2","vs.","Pool C4",null,null,22,2,"vs.",4,"Pool D2","vs.","Pool D4",null,null,28,2,"vs.",4,"Pool E2","vs.","Pool E4"]
[5,1,"vs.",4,"Pool A1","vs.","Pool A4",null,null,11,1,"vs.",4,"Pool B1","vs.","Pool B4",null,null,17,1,"vs.",4,"Pool C1","vs.","Pool C4",null,null,23,1,"vs.",4,"Pool D1","vs.","Pool D4",null,null,29,1,"vs.",4,"Pool E1","vs.","Pool E4"]
[6,2,"vs.",3,"Pool A2","vs.","Pool A3",null,null,12,2,"vs.",3,"Pool B2","vs.","Pool B3",null,null,18,2,"vs.",3,"Pool C2","vs.","Pool C3",null,null,24,2,"vs.",3,"Pool D2","vs.","Pool D3",null,null,30,2,"vs.",3,"Pool E2","vs.","Pool E3"]

{"sheet":"21 team","index":27,"n_rows":23,"n_cols":42,"rows_kept":23,"cut":false,"hidden":false,"merged":[[0,36,0,41],[1,36,1,41],[3,37,3,39],[7,37,7,39],[9,22,9,24],[0,27,0,35],[1,27,1,35],[2,28,2,32],[2,33,2,35],[3,28,3,32],[3,33,3,35],[4,28,4,32],[4,33,4,35],[5,28,5,32],[5,33,5,35],[6,28,6,32],[6,33,6,35],[7,28,7,32],[7,33,7,35],[9,31,9,33],[5,19,5,23],[5,24,5,26],[6,19,6,23],[6,24,6,26],[7,19,7,23],[7,24,7,26],[7,10,7,14],[7,15,7,17],[9,13,9,15],[0,18,0,26],[1,18,1,26],[2,19,2,23],[2,24,2,26],[3,19,3,23],[3,24,3,26],[4,19,4,23],[4,10,4,14],[4,15,4,17],[5,10,5,14],[5,15,5,17],[6,10,6,14],[4,24,4,26],[6,15,6,17],[0,9,0,17],[1,9,1,17],[2,10,2,14],[2,15,2,17],[3,10,3,14],[3,15,3,17],[0,0,0,8],[1,0,1,8],[2,1,2,5],[2,6,2,8],[3,1,3,5],[3,6,3,8],[4,1,4,5],[4,6,4,8],[5,1,5,5],[5,6,5,8],[6,1,6,5],[6,6,6,8],[7,1,7,5],[7,6,7,8],[8,1,8,5],[8,6,8,8],[10,4,10,6]]}
["21 Team Bracket",null,null,null,null,null,null,null,null,{"$f":"A1","v":"21 Team Bracket"},null,null,null,null,null,null,null,null,{"$f":"A1","v":"21 Team Bracket"},null,null,null,null,null,null,null,null,{"$f":"A1","v":"21 Team Bracket"},null,null,null,null,null,null,null,null,{"$f":"A1","v":"21 Team Bracket"}]
["Pool A",null,null,null,null,null,null,null,null,"Pool B",null,null,null,null,null,null,null,null,"Pool C",null,null,null,null,null,null,null,null,"Pool D",null,null,null,null,null,null,null,null,"Playoffs"]
["Team","Name",null,null,null,null,"Contact",null,null,"Team","Name",null,null,null,null,"Contact",null,null,"Team","Name",null,null,null,null,"Contact",null,null,"Team","Name",null,null,null,null,"Contact"]
[1,"Pool A1",null,null,null,null,null,null,null,1,"Pool B1",null,null,null,null,null,null,null,1,"Pool C1",null,null,null,null,null,null,null,1,"Pool D1",null,null,null,null,null,null,null,"Game","Semi-Final Games",null,null,"Court","Time"]
[2,"Pool A2",null,null,null,null,null,null,null,2,"Pool B2",null,null,null,null,null,null,null,2,"Pool C2",null,null,null,null,null,null,null,2,"Pool D2",null,null,null,null,null,null,null,43,"Pool A #1 Seed","vs.","Pool B #1 Seed"]
[3,"Pool A3",null,null,null,null,null,null,null,3,"Pool B3",null,null,null,null,null,null,null,3,"Pool C3",null,null,null,null,null,null,null,3,"Pool D3",null,null,null,null,null,null,null,44,"Pool C #1 Seed","vs.","Pool D #1 Seed"]
[4,"Pool A4",null,null,null,null,null,null,null,4,"Pool B4",null,null,null,null,null,null,null,4,"Pool C4",null,null,null,null,null,null,null,4,"Pool D4"]
[5,"Pool A5",null,null,null,null,null,null,null,5,"Pool B5",null,null,null,null,null,null,null,5,"Pool C5",null,null,null,null,null,null,null,5,"Pool D5",null,null,null,null,null,null,null,"Game","Championship Game",null,null,"Court","Time"]
[6,"Pool A6",null,null,null,null,null,null,null,null,null,null,null,null,null,null,null,null,null,null,null,null,null,null,null,null,null,null,null,null,null,null,null,null,null,null,45,"Winner Game 43","vs.","Winner Game 44"]
[null,null,null,null,null,null,null,null,null,"Game",null,null,null,"Teams",null,null,"Court","Time","Game",null,null,null,"Teams",null,null,"Court","Time","Game",null,null,null,"Teams",null,null,"Court","Time"]
["Game",null,null,null,"Teams",null,null,"Court","Time",13,1,"vs.",4,{"$f":"CONCATENATE((IF($J$4=K11,$K$4,IF($J$5=K11,$K$5,IF($J$6=K11,$K$6,IF($J$7=K11,$K$7,IF($J$8=K11,$K$8)))))))","v":"Pool B1"},"vs.",{"$f":"CONCATENATE((IF($J$4=M11,$K$4,IF($J$5=M11,$K$5,IF($J$6=M11,$K$6,IF($J$7=M11,$K$7,IF($J$8=M11,$K$8)))))))","v":"Pool B4"},null,null,23,1,"vs.",4,{"$f":"CONCATENATE((IF($S$4=T11,$T$4,IF($S$5=T11,$T$5,IF($S$6=T11,$T$6,IF($S$7=T11,$T$7,IF($S$8=T11,$T$8)))))))","v":"Pool C1"},"vs.",{"$f":"CONCATENATE((IF($S$4=V11,$T$4,IF($S$5=V11,$T$5,IF($S$6=V11,$T$6,IF($S$7=V11,$T$7,IF($S$8=V11,$T$8)))))))","v":"Pool C4"},null,null,33,1,"vs.",4,{"$f":"CONCATENATE((IF($AB$4=AC11,$AC$4,IF($AB$5=AC11,$AC$5,IF($AB$6=AC11,$AC$6,IF($AB$7=AC11,$AC$7,IF($AB$8=AC11,$AC$8)))))))","v":"Pool D1"},"vs.",{"$f":"CONCATENATE((IF($AB$4=AE11,$AC$4,IF($AB$5=AE11,$AC$5,IF($AB$6=AE11,$AC$6,IF($AB$7=AE11,$AC$7,IF($AB$8=AE11,$AC$8)))))))","v":"Pool D4"}]
[1,1,"vs.",6,{"$f":"CONCATENATE((IF($A$4=B12,$B$4,IF($A$5=B12,$B$5,IF($A$6=B12,$B$6,IF($A$7=B12,$B$7,IF($A$8=B12,$B$8,IF($A$9=B12,$B$9))))))))","v":"Pool A1"},"vs.",{"$f":"CONCATENATE((IF($A$4=D12,$B$4,IF($A$5=D12,$B$5,IF($A$6=D12,$B$6,IF($A$7=D12,$B$7,IF($A$8=D12,$B$8,IF($A$9=D12,$B$9))))))))","v":"Pool A6"},null,null,14,2,"vs.",3,{"$f":"CONCATENATE((IF($J$4=K12,$K$4,IF($J$5=K12,$K$5,IF($J$6=K12,$K$6,IF($J$7=K12,$K$7,IF($J$8=K12,$K$8)))))))","v":"Pool B2"},"vs.",{"$f":"CONCATENATE((IF($J$4=M12,$K$4,IF($J$5=M12,$K$5,IF($J$6=M12,$K$6,IF($J$7=M12,$K$7,IF($J$8=M12,$K$8)))))))","v":"Pool B3"},null,null,24,2,"vs.",3,{"$f":"CONCATENATE((IF($S$4=T12,$T$4,IF($S$5=T12,$T$5,IF($S$6=T12,$T$6,IF($S$7=T12,$T$7,IF($S$8=T12,$T$8)))))))","v":"Pool C2"},"vs.",{"$f":"CONCATENATE((IF($S$4=V12,$T$4,IF($S$5=V12,$T$5,IF($S$6=V12,$T$6,IF($S$7=V12,$T$7,IF($S$8=V12,$T$8)))))))","v":"Pool C3"},null,null,34,2,"vs.",3,{"$f":"CONCATENATE((IF($AB$4=AC12,$AC$4,IF($AB$5=AC12,$AC$5,IF($AB$6=AC12,$AC$6,IF($AB$7=AC12,$AC$7,IF($AB$8=AC12,$AC$8)))))))","v":"Pool D2"},"vs.",{"$f":"CONCATENATE((IF($AB$4=AE12,$AC$4,IF($AB$5=AE12,$AC$5,IF($AB$6=AE12,$AC$6,IF($AB$7=AE12,$AC$7,IF($AB$8=AE12,$AC$8)))))))","v":"Pool D3"}]
[2,2,"vs.",5,{"$f":"CONCATENATE((IF($A$4=B13,$B$4,IF($A$5=B13,$B$5,IF($A$6=B13,$B$6,IF($A$7=B13,$B$7,IF($A$8=B13,$B$8)))))))","v":"Pool A2"},"vs.",{"$f":"CONCATENATE((IF($A$4=D13,$B$4,IF($A$5=D13,$B$5,IF($A$6=D13,$B$6,IF($A$7=D13,$B$7,IF($A$8=D13,$B$8,IF($A$9=D13,$B$9))))))))","v":"Pool A5"},null,null,15,1,"vs.",3,"Pool B1","vs.","Pool B3",null,null,25,1,"vs.",3,"Pool C1","vs.","Pool C3",null,null,35,1,"vs.",3,"Pool D1","vs.","Pool D3"]
[3,3,"vs.",4,"Pool A3","vs.","Pool A4",null,null,16,4,"vs.",5,"Pool B4","vs.","Pool B5",null,null,26,4,"vs.",5,"Pool C4","vs.","Pool C5",null,null,36,4,"vs.",5,"Pool D4","vs.","Pool D5"]
[4,1,"vs.",5,"Pool A1","vs.","Pool A5",null,null,17,3,"vs.",5,"Pool B3","vs.","Pool B5",null,null,27,3,"vs.",5,"Pool C3","vs.","Pool C5",null,null,37,3,"vs.",5,"Pool D3","vs.","Pool D5"]
[5,2,"vs.",4,"Pool A2","vs.","Pool A4",null,null,18,1,"vs.",2,"Pool B1","vs.","Pool B2",null,null,28,1,"vs.",2,"Pool C1","vs.","Pool C2",null,null,38,1,"vs.",2,"Pool D1","vs.","Pool D2"]
[6,3,"vs.",6,"Pool A3","vs.","Pool A6",null,null,19,2,"vs.",5,"Pool B2","vs.","Pool B5",null,null,29,2,"vs.",5,"Pool C2","vs.","Pool C5",null,null,39,2,"vs.",5,"Pool D2","vs.","Pool D5"]
[7,1,"vs.",4,"Pool A1","vs.","Pool A4",null,null,20,3,"vs.",4,"Pool B3","vs.","Pool B4",null,null,30,3,"vs.",4,"Pool C3","vs.","Pool C4",null,null,40,3,"vs.",4,"Pool D3","vs.","Pool D4"]
[8,2,"vs.",3,"Pool A2","vs.","Pool A3",null,null,21,2,"vs.",4,"Pool B2","vs.","Pool B4",null,null,31,2,"vs.",4,"Pool C2","vs.","Pool C4",null,null,41,2,"vs.",4,"Pool D2","vs.","Pool D4"]
[9,5,"vs.",6,"Pool A5","vs.","Pool A6",null,null,22,1,"vs.",5,"Pool B1","vs.","Pool B5",null,null,32,1,"vs.",5,"Pool C1","vs.","Pool C5",null,null,42,1,"vs.",5,"Pool D1","vs.","Pool D5"]
[10,1,"vs.",3,"Pool A1","vs.","Pool A3"]
[11,2,"vs.",6,"Pool A2","vs.","Pool A6"]
[12,4,"vs.",5,"Pool A4","vs.","Pool A5"]

{"sheet":"25 team","index":28,"n_rows":20,"n_cols":51,"rows_kept":20,"cut":false,"hidden":false,"merged":[[10,46,10,48],[7,37,7,41],[7,42,7,44],[9,40,9,42],[0,45,0,50],[1,45,1,50],[3,46,3,48],[6,46,6,48],[4,37,4,41],[4,42,4,44],[5,37,5,41],[5,42,5,44],[6,37,6,41],[6,42,6,44],[0,36,0,44],[1,36,1,44],[2,37,2,41],[2,42,2,44],[3,37,3,41],[3,42,3,44],[5,28,5,32],[5,33,5,35],[2,28,2,32],[2,33,2,35],[9,31,9,33],[7,19,7,23],[5,10,5,14],[5,15,5,17],[5,19,5,23],[5,24,5,26],[7,24,7,26],[7,28,7,32],[7,33,7,35],[6,28,6,32],[6,33,6,35],[6,24,6,26],[6,15,6,17],[6,19,6,23],[9,22,9,24],[0,27,0,35],[1,9,1,17],[1,18,1,26],[1,27,1,35],[4,19,4,23],[4,24,4,26],[4,28,4,32],[4,33,4,35],[0,9,0,17],[0,18,0,26],[3,28,3,32],[3,33,3,35],[2,10,2,14],[2,15,2,17],[2,19,2,23],[2,24,2,26],[4,1,4,5],[5,1,5,5],[6,1,6,5],[4,6,4,8],[3,10,3,14],[6,6,6,8],[6,10,6,14],[5,6,5,8],[0,0,0,8],[1,0,1,8],[2,1,2,5],[2,6,2,8],[3,1,3,5],[3,6,3,8],[7,6,7,8],[9,4,9,6],[7,10,7,14],[7,15,7,17],[7,1,7,5],[9,13,9,15],[3,19,3,23],[3,24,3,26],[4,10,4,14],[4,15,4,17],[3,15,3,17]]}
["25 Team Bracket",null,null,null,null,null,null,null,null,{"$f":"A1","v":"25 Team Bracket"},null,null,null,null,null,null,null,null,{"$f":"A1","v":"25 Team Bracket"},null,null,null,null,null,null,null,null,{"$f":"A1","v":"25 Team Bracket"},null,null,null,null,null,null,null,null,{"$f":"A1","v":"25 Team Bracket"},null,null,null,null,null,null,null,null,{"$f":"A1","v":"25 Team Bracket"}]
["Pool A",null,null,null,null,null,null,null,null,"Pool B",null,null,null,null,null,null,null,null,"Pool C",null,null,null,null,null,null,null,null,"Pool D",null,null,null,null,null,null,null,null,"Pool E",null,null,null,null,null,null,null,null,"Playoffs"]
["Team","Name",null,null,null,null,"Contact",null,null,"Team","Name",null,null,null,null,"Contact",null,null,"Team","Name",null,null,null,null,"Contact",null,null,"Team","Name",null,null,null,null,"Contact",null,null,"Team","Name",null,null,null,null,"Contact"]
[1,"Pool A1",null,null,null,null,null,null,null,1,"Pool B1",null,null,null,null,null,null,null,1,"Pool C1",null,null,null,null,null,null,null,1,"Pool D1",null,null,null,null,null,null,null,1,"Pool E1",null,null,null,null,null,null,null,"Game","Play-in Game",null,null,"Court","Time"]
[2,"Pool A2",null,null,null,null,null,null,null,2,"Pool B2",null,null,null,null,null,null,null,2,"Pool C2",null,null,null,null,null,null,null,2,"Pool D2",null,null,null,null,null,null,null,2,"Pool E2",null,null,null,null,null,null,null,51,"#4 Seed Pool Winner","vs.","#5 Seed Pool Winner"]
[3,"Pool A3",null,null,null,null,null,null,null,3,"Pool B3",null,null,null,null,null,null,null,3,"Pool C3",null,null,null,null,null,null,null,3,"Pool D3",null,null,null,null,null,null,null,3,"Pool E3"]
[4,"Pool A4",null,null,null,null,null,null,null,4,"Pool B4",null,null,null,null,null,null,null,4,"Pool C4",null,null,null,null,null,null,null,4,"Pool D4",null,null,null,null,null,null,null,4,"Pool E4",null,null,null,null,null,null,null,"Game","Semi-Final Games",null,null,"Court","Time"]
[5,"Pool A5",null,null,null,null,null,null,null,5,"Pool B5",null,null,null,null,null,null,null,5,"Pool C5",null,null,null,null,null,null,null,5,"Pool D5",null,null,null,null,null,null,null,5,"Pool E5",null,null,null,null,null,null,null,52,"Winner Game 51","vs.","#1 Seed Pool Winner"]
[null,null,null,null,null,null,null,null,null,null,null,null,null,null,null,null,null,null,null,null,null,null,null,null,null,null,null,null,null,null,null,null,null,null,null,null,null,null,null,null,null,null,null,null,null,53,"#2 Seed Pool Winner","vs.","#3 Seed Pool Winner"]
["Game",null,null,null,"Teams",null,null,"Court","Time","Game",null,null,null,"Teams",null,null,"Court","Time","Game",null,null,null,"Teams",null,null,"Court","Time","Game",null,null,null,"Teams",null,null,"Court","Time","Game",null,null,null,"Teams",null,null,"Court","Time"]
[1,1,"vs.",4,{"$f":"CONCATENATE((IF($A$4=B11,$B$4,IF($A$5=B11,$B$5,IF($A$6=B11,$B$6,IF($A$7=B11,$B$7,IF($A$8=B11,$B$8)))))))","v":"Pool A1"},"vs.",{"$f":"CONCATENATE((IF($A$4=D11,$B$4,IF($A$5=D11,$B$5,IF($A$6=D11,$B$6,IF($A$7=D11,$B$7,IF($A$8=D11,$B$8)))))))","v":"Pool A4"},null,null,11,1,"vs.",4,{"$f":"CONCATENATE((IF($J$4=K11,$K$4,IF($J$5=K11,$K$5,IF($J$6=K11,$K$6,IF($J$7=K11,$K$7,IF($J$8=K11,$K$8)))))))","v":"Pool B1"},"vs.",{"$f":"CONCATENATE((IF($J$4=M11,$K$4,IF($J$5=M11,$K$5,IF($J$6=M11,$K$6,IF($J$7=M11,$K$7,IF($J$8=M11,$K$8)))))))","v":"Pool B4"},null,null,21,1,"vs.",4,{"$f":"CONCATENATE((IF($S$4=T11,$T$4,IF($S$5=T11,$T$5,IF($S$6=T11,$T$6,IF($S$7=T11,$T$7,IF($S$8=T11,$T$8)))))))","v":"Pool C1"},"vs.",{"$f":"CONCATENATE((IF($S$4=V11,$T$4,IF($S$5=V11,$T$5,IF($S$6=V11,$T$6,IF($S$7=V11,$T$7,IF($S$8=V11,$T$8)))))))","v":"Pool C4"},null,null,31,1,"vs.",4,{"$f":"CONCATENATE((IF($AB$4=AC11,$AC$4,IF($AB$5=AC11,$AC$5,IF($AB$6=AC11,$AC$6,IF($AB$7=AC11,$AC$7,IF($AB$8=AC11,$AC$8)))))))","v":"Pool D1"},"vs.",{"$f":"CONCATENATE((IF($AB$4=AE11,$AC$4,IF($AB$5=AE11,$AC$5,IF($AB$6=AE11,$AC$6,IF($AB$7=AE11,$AC$7,IF($AB$8=AE11,$AC$8)))))))","v":"Pool D4"},null,null,41,1,"vs.",4,{"$f":"CONCATENATE((IF($AK$4=AL11,$AL$4,IF($AK$5=AL11,$AL$5,IF($AK$6=AL11,$AL$6,IF($AK$7=AL11,$AL$7,IF($AK$8=AL11,$AL$8)))))))","v":"Pool E1"},"vs.",{"$f":"CONCATENATE((IF($AK$4=AN11,$AL$4,IF($AK$5=AN11,$AL$5,IF($AK$6=AN11,$AL$6,IF($AK$7=AN11,$AL$7,IF($AK$8=AN11,$AL$8)))))))","v":"Pool E4"},null,null,"Game","Championship Game",null,null,"Court","Time"]
[2,2,"vs.",3,{"$f":"CONCATENATE((IF($A$4=B12,$B$4,IF($A$5=B12,$B$5,IF($A$6=B12,$B$6,IF($A$7=B12,$B$7,IF($A$8=B12,$B$8)))))))","v":"Pool A2"},"vs.",{"$f":"CONCATENATE((IF($A$4=D12,$B$4,IF($A$5=D12,$B$5,IF($A$6=D12,$B$6,IF($A$7=D12,$B$7,IF($A$8=D12,$B$8)))))))","v":"Pool A3"},null,null,12,2,"vs.",3,{"$f":"CONCATENATE((IF($J$4=K12,$K$4,IF($J$5=K12,$K$5,IF($J$6=K12,$K$6,IF($J$7=K12,$K$7,IF($J$8=K12,$K$8)))))))","v":"Pool B2"},"vs.",{"$f":"CONCATENATE((IF($J$4=M12,$K$4,IF($J$5=M12,$K$5,IF($J$6=M12,$K$6,IF($J$7=M12,$K$7,IF($J$8=M12,$K$8)))))))","v":"Pool B3"},null,null,22,2,"vs.",3,{"$f":"CONCATENATE((IF($S$4=T12,$T$4,IF($S$5=T12,$T$5,IF($S$6=T12,$T$6,IF($S$7=T12,$T$7,IF($S$8=T12,$T$8)))))))","v":"Pool C2"},"vs.",{"$f":"CONCATENATE((IF($S$4=V12,$T$4,IF($S$5=V12,$T$5,IF($S$6=V12,$T$6,IF($S$7=V12,$T$7,IF($S$8=V12,$T$8)))))))","v":"Pool C3"},null,null,32,2,"vs.",3,{"$f":"CONCATENATE((IF($AB$4=AC12,$AC$4,IF($AB$5=AC12,$AC$5,IF($AB$6=AC12,$AC$6,IF($AB$7=AC12,$AC$7,IF($AB$8=AC12,$AC$8)))))))","v":"Pool D2"},"vs.",{"$f":"CONCATENATE((IF($AB$4=AE12,$AC$4,IF($AB$5=AE12,$AC$5,IF($AB$6=AE12,$AC$6,IF($AB$7=AE12,$AC$7,IF($AB$8=AE12,$AC$8)))))))","v":"Pool D3"},null,null,42,2,"vs.",3,{"$f":"CONCATENATE((IF($AK$4=AL12,$AL$4,IF($AK$5=AL12,$AL$5,IF($AK$6=AL12,$AL$6,IF($AK$7=AL12,$AL$7,IF($AK$8=AL12,$AL$8)))))))","v":"Pool E2"},"vs.",{"$f":"CONCATENATE((IF($AK$4=AN12,$AL$4,IF($AK$5=AN12,$AL$5,IF($AK$6=AN12,$AL$6,IF($AK$7=AN12,$AL$7,IF($AK$8=AN12,$AL$8)))))))","v":"Pool E3"},null,null,54,"Winner Game 52","vs.","Winner Game 54"]
[3,1,"vs.",3,"Pool A1","vs.","Pool A3",null,null,13,1,"vs.",3,"Pool B1","vs.","Pool B3",null,null,23,1,"vs.",3,"Pool C1","vs.","Pool C3",null,null,33,1,"vs.",3,"Pool D1","vs.","Pool D3",null,null,43,1,"vs.",3,"Pool E1","vs.","Pool E3"]
[4,4,"vs.",5,"Pool A4","vs.","Pool A5",null,null,14,4,"vs.",5,"Pool B4","vs.","Pool B5",null,null,24,4,"vs.",5,"Pool C4","vs.","Pool C5",null,null,34,4,"vs.",5,"Pool D4","vs.","Pool D5",null,null,44,4,"vs.",5,"Pool E4","vs.","Pool E5"]
[5,3,"vs.",5,"Pool A3","vs.","Pool A5",null,null,15,3,"vs.",5,"Pool B3","vs.","Pool B5",null,null,25,3,"vs.",5,"Pool C3","vs.","Pool C5",null,null,35,3,"vs.",5,"Pool D3","vs.","Pool D5",null,null,45,3,"vs.",5,"Pool E3","vs.","Pool E5"]
[6,1,"vs.",2,"Pool A1","vs.","Pool A2",null,null,16,1,"vs.",2,"Pool B1","vs.","Pool B2",null,null,26,1,"vs.",2,"Pool C1","vs.","Pool C2",null,null,36,1,"vs.",2,"Pool D1","vs.","Pool D2",null,null,46,1,"vs.",2,"Pool E1","vs.","Pool E2"]
[7,2,"vs.",5,"Pool A2","vs.","Pool A5",null,null,17,2,"vs.",5,"Pool B2","vs.","Pool B5",null,null,27,2,"vs.",5,"Pool C2","vs.","Pool C5",null,null,37,2,"vs.",5,"Pool D2","vs.","Pool D5",null,null,47,2,"vs.",5,"Pool E2","vs.","Pool E5"]
[8,3,"vs.",4,"Pool A3","vs.","Pool A4",null,null,18,3,"vs.",4,"Pool B3","vs.","Pool B4",null,null,28,3,"vs.",4,"Pool C3","vs.","Pool C4",null,null,38,3,"vs.",4,"Pool D3","vs.","Pool D4",null,null,48,3,"vs.",4,"Pool E3","vs.","Pool E4"]
[9,2,"vs.",4,"Pool A2","vs.","Pool A4",null,null,19,2,"vs.",4,"Pool B2","vs.","Pool B4",null,null,29,2,"vs.",4,"Pool C2","vs.","Pool C4",null,null,39,2,"vs.",4,"Pool D2","vs.","Pool D4",null,null,49,2,"vs.",4,"Pool E2","vs.","Pool E4"]
[10,1,"vs.",5,"Pool A1","vs.","Pool A5",null,null,20,1,"vs.",5,"Pool B1","vs.","Pool B5",null,null,30,1,"vs.",5,"Pool C1","vs.","Pool C5",null,null,40,1,"vs.",5,"Pool D1","vs.","Pool D5",null,null,50,1,"vs.",5,"Pool E1","vs.","Pool E5"]