{"text_format":"1","workbook":"xlsx","n_sheets":13,"sheets":["Impact Wanderers","Instructions & Basic Setup","Transport","Accommodation","Consumption and waste","Leisure","Volunteering","Dashboard - Results","backoffice","sources","ideas","Feuil1","Feuil2"],"not_rendered":{"charts":8,"images":110,"macros":1,"external_links":0,"defined_names":8,"comments":1,"pivot_tables":0},"unopened":[],"bounds":{"document_bytes":16777216,"sheet_cells":100000,"rows_first":2000,"rows_last":500,"rows_between":2000,"halvings":0,"cell_chars":16384,"cell_head_chars":4096},"cells_cut":0,"cells_raw":0,"read":"whole","date_system":"1900"}

{"sheet":"Impact Wanderers","index":0,"n_rows":0,"n_cols":0,"rows_kept":0,"cut":false,"hidden":false,"merged":[]}

{"sheet":"Instructions & Basic Setup","index":1,"n_rows":38,"n_cols":8,"rows_kept":38,"cut":false,"hidden":false,"merged":[[35,1,35,2],[36,1,36,2],[37,1,37,2],[0,1,1,5],[0,7,1,8],[27,1,27,2],[28,1,28,2],[29,1,29,2],[30,1,30,2],[20,1,20,2],[22,1,22,2],[21,1,21,2],[33,1,33,2],[34,1,34,2]]}
[null,"Let's get started: instructions",null,null,null,null,null,"Powered by Impact Wanderers"]
[]
[]
[]
[]
[]
[]
[]
[null,"This tool has been built to help you understand the negative and positive impact of your travels - both for a socio-economic and environmental perspective."]
[null,"We split the assessment in five parts: Transport, Accommodation, Consumption & waste, Leisure and volunteering."]
[null,"You can only enter one country at a time in this tool. If you wish to do the assessments for several countries, please save and complete several versions of this tool."]
[null,"We will soon publish an add-on that allows you to compare different countries. Stay tuned!"]
[]
[null,"This tool is meant to make you and us think about the impact of our choices while we travel - it is by no means meant to give a specific answer!"]
[null,"Indeed, impact assessment is a constantly evolving science."]
[null,"If you have ideas as to how to improve the visuals, frameworks, indicators, messages or datasets, do not hesitate to contact us. This tool is meant to evolve through time and integrate your feedback!"]
[]
[null,"Throughout the tool, we use the following visual code:"]
[]
[null,null,null,"Category name: do not touch"]
[null,null,null,"Data input: ONLY FILL IN THESE CELLS"]
[null,null,null,"Results: do not touch"]
[null,null,null,"Main results: do not touch"]
[null,null,null,"Navigation: click on the footprints to navigate between pages."]
[]
[]
[null,"THE DATA INPUT STARTS HERE: Please fill in the light orange cells below."]
[null,"# of days"]
[null,"# of travellers"]
[null,"Country in which you travel",null,"(Please select)"]
{"$rows_left_out":9}
{"sheet":"Transport","index":2,"n_rows":196,"n_cols":13,"rows_kept":196,"cut":false,"hidden":false,"merged":[[12,1,12,2],[185,1,185,7],[14,1,14,2],[89,1,89,2],[86,1,86,2],[75,1,75,2],[76,3,77,3],[43,1,43,2],[28,1,29,1],[67,1,67,5],[76,4,77,4],[79,1,82,4],[73,1,73,2],[170,6,170,12],[0,1,1,4],[18,1,22,6],[117,1,119,6],[166,1,168,7],[0,5,1,6],[13,1,13,2],[28,7,28,10],[76,1,77,2],[92,1,94,4],[69,1,70,8],[28,3,28,5],[121,3,121,5],[9,1,9,2],[8,1,8,2],[10,1,10,2],[11,1,11,2]]}
[null,"Transport: Carbon footprint and climate change",null,null,null,"Powered by Impact Wanderers"]
[]
[]
[]
[]
[]
[]
[]
[null,"Environmental impact",null,null,"Your travel:"]
[null,"Carbon footprint",null,null,"# of days",{"$f":"'Instructions & Basic Setup'!D28","v":0}]
[null,"Avoided emissions",null,null,"# of travellers",{"$f":"'Instructions & Basic Setup'!D29","v":0}]
[null,"What if analysis",null,null,"Country",{"$f":"'Instructions & Basic Setup'!D30","v":"(Please select)"}]
[null,"What if you had stayed home?",null,null,"Where is home?",{"$f":"'Instructions & Basic Setup'!D31","v":"(Please select)"}]
[null,"Socio-economic impact",null,null,"If you need to modify information on your travel, please do it on the instructions page."]
[null,"Results"]
[]
[null,"Environmental impact: How much greenhouse gas emissions did you emit?",null,null,null,null,null,"Back to top"]
[]
[null,"How to make the tool work? Specify below in the light orange cells the amount of kilometers and # of days travelled with each means of transportation. You can find the kilometers on websites such as google.maps. If you have the amount and type of fuel consumed (column D, E and F), it may help obtain more specific results, in particular for local transports such as tuk tuk ride or hybrid vehicles. If not, we will use an estimation (check the level of uncertainty in column H). Enter the number of people being transported in the car, tuk tuk (etc...) for private transport. In Cambodia, some of our shared cabs were taking 9 people!"]
[]
[]
[]
[]
[]
[null,"# of days",{"$f":"F10","v":0}]
[null,"# of travellers",{"$f":"F11","v":0}]
[null,"Country",{"$f":"F12","v":"(Please select)"}]
[]
[null,"Enter your data in the light orange cells (google.maps can help!)",null,"Optional",null,null,null,"Check out your results here and on the graphs below!"]
[null,null,"Total kilometers per person (over full time period)","Average # of people (total) in the vehicle","Total fuel consumption of the vehicle (litres)","Type of fuel",null,"Total kilometers per person per day","Greenhouse gases emissions (kg) per person per day","Level of certainty (3=best)","% repartition of greenhouse gases emissions"]
{"$rows_left_out":167}
{"sheet":"Accommodation","index":3,"n_rows":72,"n_cols":13,"rows_kept":72,"cut":false,"hidden":false,"merged":[[28,4,29,5],[56,1,56,7],[25,1,25,2],[8,1,8,2],[9,1,9,2],[10,1,10,2],[41,6,41,12],[31,1,31,2],[22,4,22,5],[37,1,39,6],[0,5,1,6],[0,1,1,4],[18,1,20,6],[23,4,25,5],[26,4,27,5],[23,1,23,2],[26,1,26,2],[24,1,24,2],[27,1,27,2],[32,1,32,2],[31,4,31,8],[28,1,28,2],[29,1,29,2],[32,4,32,8]]}
[null,"Accomodation: your money does not sleep",null,null,null,"Powered by Impact Wanderers"]
[]
[]
[]
[]
[]
[]
[null,null,null,null,"# of days",{"$f":"'Instructions & Basic Setup'!D28","v":0}]
[null,"Environmental impact",null,null,"# of travellers",{"$f":"'Instructions & Basic Setup'!D29","v":0}]
[null,"Socio-economic impact",null,null,"Country",{"$f":"'Instructions & Basic Setup'!D30","v":"(Please select)"}]
[null,"Results",null,null,"Where is home?",{"$f":"'Instructions & Basic Setup'!D31","v":"(Please select)"}]
[null,null,null,null,"If you need to modify information on your travel, please do it here:"]
[null,"Environmental impact: focus on \"special situations\"",null,null,null,null,null,"Back to top"]
[]
[null,"# of days",{"$f":"F8","v":0}]
[null,"# of travellers",{"$f":"F9","v":0}]
[null,"Country",{"$f":"F10","v":"(Please select)"}]
[]
[null,"We identify \"special situations\" (either in the positive or negative) and assess them by assigning them a high-level bonus/malus score. For example, we stayed in a few places where electricity was 100% renewable, thereby saving carbon emissions. We assign a bonus of 4 out of 5. In addition, we need to take into account the context: saving energy is far more important from an climate change perspective in a country where the energy mix is very carbon-intensive. We include an index to shed light on this, with 100 the worst situation and 0 the worst."]
[]
[]
[null,"Instructions: fill in the orange cells"]
[null,"# of nights spent…:",null,null,"Rationale",null,"Bonus/malus",null,null,"Bonus/malus"]
[null,"… camping/ no electricity",null,"NA","… thereby not emitting greenhouse gases linked to energy use.",null,0,null,null,1]
[null,"… couchsurfing",null,"NA",null,null,1,null,null,2]
[null,"… in places running on 80+% renewable energy",null,"NA",null,null,0,null,null,2]
[null,"… dorms",null,"NA","Dorms and homestays tend to use less energy than hotels, given that you share the common areas/ rooms with more people.",null,2,null,null,3]
[null,"… homestays ",null,"NA",null,null,3,null,null,3]
[null,"… mid-range hotels",null,"NA","These hotels tend to use more energy and water per client (more space, lights, swimming pool, towels…)",null,3,null,null,4]
[null,"… high-end hotels ",null,"NA",null,null,5,null,null,5]
{"$rows_left_out":43}
{"sheet":"Consumption and waste","index":4,"n_rows":114,"n_cols":13,"rows_kept":114,"cut":false,"hidden":false,"merged":[[97,1,97,7],[0,1,1,5],[8,1,8,2],[11,1,11,2],[37,1,37,2],[36,1,36,2],[35,1,35,2],[19,1,19,2],[9,1,9,2],[10,1,10,2],[23,2,23,3],[12,1,12,2],[75,6,76,12],[39,1,39,2],[81,6,81,12],[45,4,45,5],[46,4,46,5],[47,4,47,5],[48,4,48,5],[50,1,51,5],[77,1,79,6],[0,6,1,7],[16,1,17,5],[21,1,21,5],[41,1,41,5],[44,4,44,5]]}
[null,"Consumption and waste: you are what you buy (and waste…)",null,null,null,null,"Powered by Impact Wanderers"]
[]
[]
[]
[]
[]
[]
[null,null,null,null,"Your travel:"]
[null,"Environmental impact",null,null,"# of days",{"$f":"'Instructions & Basic Setup'!D28","v":0}]
[null,"Focus on plastic waste",null,null,"# of travellers",{"$f":"'Instructions & Basic Setup'!D29","v":0}]
[null,"Focus on food",null,null,"Country",{"$f":"'Instructions & Basic Setup'!D30","v":"(Please select)"}]
[null,"Socio-economic impact",null,null,"Where is home?",{"$f":"'Instructions & Basic Setup'!D31","v":"(Please select)"}]
[null,"Results",null,null,"If you need to modify information on your travel, please do it here:"]
[]
[null,"Environmental impact: focus on plastic waste and food",null,null,null,"Back to top"]
[]
[null,"Consumption of food and souvenirs can have a wide range of environmental impact, through waste but also the resources needed and the pollution generated by their production. While it is possible to quantify the carbon, water, biodiversity and pollution footprint of consumption, it is time-consuming and necessitates a large amount of data. Therefore, we adopt here an intermediate approach, where we focus on the amount of plastic waste generated and the type of food consumed."]
[]
[]
[null,"Focus on plastic waste"]
[]
[null,"In certain countries, a traveller may generate much more plastic waste than at home, because of the straws, plastic bottles etc. Minimizing one's plastic footprint (and more broadly waste) is particularly important as many countries do not have a proper waste collection and management system in place."]
[]
[null,null,"Instructions: fill in the light orange cells",null,"Optional"]
[null,null,"# bought/ consumed while travelling (approximation) for all travellers","Estimated weight (kg)","# bought/ consumed while at home, over the same period of time (approximation)","Estimated weight (kg)"]
[null,"# of plastic cups",null,{"$f":"15/1000*C26","v":0},"NA",{"$f":"IFERROR(15/1000*E26,\"NA\")","v":"NA"}]
[null,"# of plastic bags",null,{"$f":"5/1000*C27","v":0},"NA",{"$f":"IFERROR(5/1000*E27,\"NA\")","v":"NA"}]
[null,"# straws",null,{"$f":"C28*10/1000","v":0},"NA",{"$f":"IFERROR(E28*10/1000,\"NA\")","v":"NA"}]
[null,"# of plastic bottles (33 cl)",null,{"$f":"10*33/50/1000*C29","v":0},"NA",{"$f":"IFERROR(10*33/50/1000*E29,\"NA\")","v":"NA"}]
[null,"# of plastic bottles (1L)",null,{"$f":"10*100/50/1000*C30","v":0},"NA",{"$f":"IFERROR(10*100/50/1000*E30,\"NA\")","v":"NA"}]
{"$rows_left_out":85}
{"sheet":"Leisure","index":5,"n_rows":84,"n_cols":13,"rows_kept":84,"cut":false,"hidden":false,"merged":[[0,1,1,5],[0,7,1,9],[17,6,17,12],[9,1,11,8],[32,1,32,7]]}
[null,"Leisure: have fun with you money",null,null,null,null,null,"Powered by Impact Wanderers"]
[]
[]
[]
[]
[]
[]
[null,"Socio-economic impact: What is your spend profile?"]
[]
[null,"What is the socio-economic impact of your leisure? This is very hard to evaluate, but as a proxy we suggest analysing your spend profile. Did you give more to small businesses or large ones? Was your money spent in the local economy or on international brands? Was your money spent in an organization that seeks to have a \"positive impact\"?"]
[]
[]
[]
[null,"# of days",{"$f":"'Instructions & Basic Setup'!D28","v":0}]
[null,"# of travellers",{"$f":"'Instructions & Basic Setup'!D29","v":0}]
[null,"Country",{"$f":"'Instructions & Basic Setup'!D30","v":"(Please select)"}]
[]
[null,"Instructions: Check the results below after filling the light orange cells on the right. ",null,null,null,null,"Enter all what you spent on leisure over the specified period of time, for all travellers. Add as many lines as necessary. "]
[null,null,"Total USD","USD per person per day","%",null,"Country","Description","Classification","Business type","Local/ international","Positive impact?","Spent ($)"]
[null,"Small ",{"$f":"SUMIF($E$35:$E$500,$B20,$H$35:$H$500)","v":0},{"$f":"IFERROR(C20/$C$14/$C$15,\"NA\")","v":"NA"},{"$f":"IFERROR(D20/SUM($D$20:$D$24),\"NA\")","v":"NA"},null,{"$f":"$C$16","v":"(Please select)"},"prostitutes","Leisure","Medium","Local","N",500]
[null,"Medium",{"$f":"SUMIF($E$35:$E$500,$B21,$H$35:$H$500)","v":0},{"$f":"IFERROR(C21/$C$14/$C$15,\"NA\")","v":"NA"},{"$f":"IFERROR(D21/SUM($D$20:$D$24),\"NA\")","v":"NA"},null,{"$f":"$C$16","v":"(Please select)"},"surf","Leisure","Medium","Local","N",50]
[null,"Large",{"$f":"SUMIF($E$35:$E$500,$B22,$H$35:$H$500)","v":0},"NA","NA",null,"(Please select)","Safari","Leisure","Medium","Local","N",200]
[null,"Public services",{"$f":"SUMIF($E$35:$E$500,$B23,$H$35:$H$500)","v":0},"NA","NA",null,"(Please select)",null,"Leisure","Medium","Local","N"]
[null,"Religious institutions",{"$f":"SUMIF($E$35:$E$500,$B24,$H$35:$H$500)","v":0},"NA","NA",null,"(Please select)",null,"Leisure","Medium","Local","N"]
[null,null,null,null,null,null,"(Please select)",null,"Leisure","Medium","Local","N"]
[null,"Local",{"$f":"SUMIF($F$35:$F$500,$B26,$H$35:$H$500)","v":0},{"$f":"IFERROR(C26/$C$14/$C$15,\"NA\")","v":"NA"},{"$f":"IFERROR(D26/SUM($D$26:$D$27),\"NA\")","v":"NA"},null,"(Please select)",null,"Leisure","Medium","Local","N"]
[null,"International",{"$f":"SUMIF($F$35:$F$500,$B27,$H$35:$H$500)","v":0},{"$f":"IFERROR(C27/$C$14/$C$15,\"NA\")","v":"NA"},{"$f":"IFERROR(D27/SUM($D$26:$D$27),\"NA\")","v":"NA"},null,"(Please select)",null,"Leisure","Medium","Local","N"]
[null,null,null,null,null,null,"(Please select)",null,"Leisure","Medium","Local","N"]
[null,"Positive impact",{"$f":"SUMIF($G$35:$G$500,\"Y\",$H$35:$H$500)","v":0},{"$f":"IFERROR(C29/$C$14/$C$15,\"NA\")","v":"NA"},{"$f":"IFERROR(D29/D31,\"NA\")","v":"NA"},null,"(Please select)",null,"Leisure","Medium","Local","N"]
[null,"Conventional",{"$f":"C31-C29","v":0},null,null,null,"(Please select)",null,"Leisure","Medium","Local","N"]
{"$rows_left_out":55}
{"sheet":"Volunteering","index":6,"n_rows":34,"n_cols":8,"rows_kept":34,"cut":false,"hidden":false,"merged":[[0,7,1,10],[0,1,1,5],[8,1,10,8],[18,1,18,8],[12,1,12,8],[13,1,13,5],[14,1,14,8],[16,1,16,8],[15,1,15,8]]}
[null,"Volunteering: how did you spend your time?",null,null,null,null,null,"Powered by Impact Wanderers"]
[]
[]
[]
[]
[]
[]
[]
[null,"In this section, we assess the positive impact of volunteering activities. We leave it to you to determine whether what you did can be classified as having a \"positive impact\". For exemple, in our case, we consider that a volunteering experience on an organic or permaculture farm could be classified as \"positive impact\". However, we do not include experiences such as helping in hostels with no environmental or social purpose."]
[]
[]
[]
[null,"It is hard to determine whether a particular volunteering experience really had a positive impact. We leave it to you to determine this, as you know better than anybody else! However, as a guidance, here are some of the criteria that we use to determine whether our own volunteering may have had a \"positive impact\":"]
[null,"The organisation has an environmental or social purpose."]
[null,"You performed tasks in which you were \"operational\" right away (e.g. distributing food) or stayed a longer time in the organisation (> one month)"]
[null,"If you worked directly with kids or people, you stayed at least 3 months."]
[null,"You did not perform a task that a local person could have done, for a salary."]
[]
[null,"In some organizations, volunteers are asked to pay. We consider this money to have \"positive impact\" but classify it under the categories \"Accomodation\" and \"Consumption & Waste\". For example, in Cambodia we paid 5 USD per day per person. We considered that 50% of the money was for food and the other for accomodation and therefore included them in the socio-economic impact on the relevant pages."]
[]
[null,"Your travel:"]
[null,"# of days",{"$f":"'Instructions & Basic Setup'!D28","v":0}]
[null,"# of travellers",{"$f":"'Instructions & Basic Setup'!D29","v":0}]
[null,"Country",{"$f":"'Instructions & Basic Setup'!D30","v":"(Please select)"}]
[null,"If you need to modify information on your travel, please do it here:"]
[]
[null,"Instructions: Fill in the light orange cells below."]
[null,"Name of the project","# of full-days volunteering per person"]
[]
[]
{"$rows_left_out":5}
{"sheet":"Dashboard - Results","index":7,"n_rows":229,"n_cols":17,"rows_kept":229,"cut":false,"hidden":false,"merged":[[105,3,105,4],[105,5,105,6],[120,5,120,6],[174,3,174,4],[174,5,174,6],[122,5,122,6],[145,2,145,3],[147,2,147,3],[148,2,149,3],[148,4,149,4],[148,5,149,5],[142,1,143,7],[121,2,121,3],[121,5,121,6],[151,1,153,7],[163,1,165,7],[158,2,158,3],[169,5,170,7],[172,1,172,7],[157,2,157,3],[160,2,160,3],[184,2,184,3],[185,2,185,3],[186,2,186,3],[228,2,228,3],[187,2,187,3],[189,1,189,4],[218,2,218,3],[196,5,196,6],[200,5,200,6],[219,2,219,3],[220,2,220,3],[197,5,199,6],[202,5,202,6],[194,1,194,7],[191,5,192,7],[0,1,1,5],[98,1,98,6],[15,1,15,4],[16,1,16,4],[17,1,17,4],[18,1,18,4],[19,1,19,4],[20,1,20,4],[14,1,14,4],[0,6,1,7],[226,2,226,3],[227,2,227,3],[224,2,224,3],[221,2,221,3],[222,2,222,3],[32,5,33,7],[86,1,86,5],[88,5,89,7],[103,1,103,7],[100,5,101,7],[64,1,69,1],[35,1,37,7],[49,6,59,7],[91,1,92,7],[40,1,45,1],[210,5,211,7],[213,1,215,7],[218,5,220,7],[221,5,222,7],[223,5,224,7],[223,2,223,3]]}
[null,"Summary results: Your dashboard",null,null,null,null,"Powered by Impact Wanderers"]
[]
[]
[]
[]
[]
[]
[]
[null,"On this page, you can see a summary of all the main results in each impact category. "]
[null,"Just follow the footprints to go to the relevant section to get the details."]
[null,"No need to fill anything on this page - just check out the results!"]
[]
[null,{"$f":"CONCATENATE(\"Overall results for your travel in\",\" \", 'Instructions & Basic Setup'!D30)","v":"Overall results for your travel in (Please select)"}]
[]
[null,"Your overall scores: 5 = worst, 0 = best",null,null,null,"Your performance while travelling","Compared with home (where available)",null,null,null,"While travelling","While at home"]
[null,"Socio-economic impact: Spend profile",null,null,null,{"$f":"IFERROR(IF(H16=0,5,IF(H16<0.2,4,IF(H16<0.4,3,IF(H16<0.6,2,IF(H16<0.8,1,0))))),\"NA\")","v":"NA"},"NA",{"$f":"0.33*D47+0.33*J46+0.33*K46","v":{"$error":"#VALUE!"}},null,"Spend",{"$f":"F16","v":"NA"},{"$f":"G16","v":"NA"},4.5,3.5,2.5,1.5,0.5]
[null,"Socio-economic impact: Volunteering",null,null,null,{"$f":"IF(D97=0,5,IF(D97<0.2,4,IF(D97<0.4,3,IF(D97<0.6,2,IF(D97<0.8,1,IF(D97<1,0,IF(D97=1,0,\"NA\")))))))","v":"NA"},"NA",null,null,"Volunteering",{"$f":"F17","v":"NA"},"NA",4.5,3.5,2.5,1.5,0.5]
[null,"Environmental impact: Greenhouse gases from transport",null,null,null,{"$f":"IFERROR(IF(H18>1,5,IF(AND(H18=0,D120=0),\"NA\",IF(H18=0,0,IF(H18<0.5,1,IF(H18<0.7,2,IF(H18<0.8,3,IF(H18<1,4))))))),\"NA\")","v":"NA"},{"$f":"IFERROR(IF(I18>1,5,IF(AND(I18=0,F120=0),\"NA\",IF(I18=0,0,IF(I18<0.5,1,IF(I18<0.7,2,IF(I18<0.8,3,IF(I18<1,4))))))),\"NA\")","v":"NA"},{"$f":"E120/(3000/365)","v":{"$error":"#VALUE!"}},{"$f":"G120/(3000/365)","v":{"$error":"#VALUE!"}},"Transport","NA","NA",4.5,3.5,2.5,1.5,0.5]
[null,"Environmental impact: Plastic waste",null,null,null,{"$f":"IF(E188=0,0,IF(E188<20,1,IF(E188<40,2,IF(E188<60,3,IF(E188<80,4,IF(E188=\"NA\",\"NA\",5))))))","v":"NA"},{"$f":"IF(G188=0,\"NA\",IF(G188<19,0,IF(G188<20,1,IF(G188<40,2,IF(G188<60,3,IF(G188<80,4,IF(G188=\"NA\",\"NA\",5)))))))","v":"NA"},{"$f":"IFERROR(IF($E$187>0.5,$E$185/'Instructions & Basic Setup'!$D$28/'Instructions & Basic Setup'!$D$29*100/(1*10*100/50/1000),$E$185/'Instructions & Basic Setup'!$D$28/'Instructions & Basic Setup'!$D$29*100/(1*10*100/50/1000)*($E$187*2)),\"NA\")","v":"NA"},{"$f":"IFERROR(IF($G$187>0.5,$G$185/'Instructions & Basic Setup'!$D$28/'Instructions & Basic Setup'!$D$29*100/(2*10*100/50/1000),$G$185/'Instructions & Basic Setup'!$D$28/'Instructions & Basic Setup'!$D$29*100/(2*10*100/50/1000)*($G$187*2)),\"NA\")","v":"NA"},"Plastic ","NA","NA",4.5,3.5,2.5,1.5,0.5]
[null,"Environmental impact: Food choices",null,null,null,{"$f":"IF(H20=0,5,IF(H20<0.2,4,IF(H20<0.4,3,IF(H20<0.6,2,IF(H20<0.8,1,IF(H20=\"Fill in\",\"NA\",0))))))","v":"NA"},{"$f":"IF(I20=0,5,IF(I20<0.2,4,IF(I20<0.4,3,IF(I20<0.6,2,IF(I20<0.8,1,IF(I20=\"Fill in\",\"NA\",0))))))","v":"NA"},{"$f":"IF(D203=\"NA\",IF($D$198>$D$200,$D$198,$D$200),D203)","v":"Fill in"},{"$f":"IF(E203=\"NA\",IF($E$198>$E$200,$E$198,$E$200),E203)","v":"Fill in"},"Food ","NA","NA",4.5,3.5,2.5,1.5,0.5]
[null,"Environmental impact: Accommodation choices",null,null,null,{"$f":"IFERROR(ROUND(E229,0),\"NA\")","v":"NA"},"NA",null,null,"Accommodation","NA","NA",4.5,3.5,2.5,1.5,0.5]
[]
[]
[]
[]
[]
[]
[]
[]
[]
{"$rows_left_out":200}
{"sheet":"backoffice","index":8,"n_rows":19,"n_cols":11,"rows_kept":19,"cut":false,"hidden":true,"merged":[]}
[]
[]
["red",165,115,156,198,165]
["green",150,81,97,113,28]
["blue",181,115,132,148,74]
[]
["(Please select)",null,"(Please select)",null,"(Please select)",null,"(Please select)",null,null,"(Please select)","(Please select)"]
["Small ",null,"Food & Bev",null,"Leisure",null,"Diesel (average biofuel blend)",null,null,"Local","Y"]
["Medium",null,"Shopping",null,"Culture",null,"Diesel (100% mineral diesel)",null,null,"International","N"]
["Large",null,null,null,null,null,"Petrol (average biofuel blend)"]
["Public services",null,null,null,null,null,"Petrol (100% mineral petrol)"]
["Religious institutions",null,null,null,null,null,"CNG"]
[null,null,null,null,null,null,"LNG"]
[null,null,null,null,null,null,"LPG"]
[null,null,null,null,null,null,"Other petroleum gas"]
[null,null,null,null,null,null,"Fuel oil"]
[null,null,null,null,null,null,"Gas oil"]
[null,null,null,null,null,null,"Marine gas oil"]
[null,null,null,null,null,null,"Marine fuel oil"]

{"sheet":"sources","index":9,"n_rows":392,"n_cols":11,"rows_kept":392,"cut":false,"hidden":true,"merged":[[27,0,30,0]]}
[]
[]
["Emission factors"]
[]
[]
["Plane",0.19,"Defra, international, economy class (incl. Production and combustion of fuel)"]
["Private car/ cab",{"$f":"0.17+0.04","v":0.21000000000000002},"Defra, average car (incl. Production and combustion of fuel)"]
["Camping car",0.41,"14L au 100","a contresens"]
["Motorbike",{"$f":"0.11+0.03","v":0.14000000000000001},"Defra, average motorbike (incl. Production and combustion of fuel)"]
["Scooter",{"$f":"0.08+0.02","v":0.1},"Defra, small motorbike (incl. Production and combustion of fuel)"]
["Tuk tuk",{"$f":"(2.3+0.6)/25/2","v":5.7999999999999996E-2},"Defra + testimony"]
["Boat",0.05,null,"blue economy"]
["Bus",3.4000000000000002E-2,null,null,null,"bus lower than train?"]
["Train",0.06,"https://www.co2nnect.org/help_sheets/?op_id=602&opt_id=98"]
["Hitchhiking",0]
["Bicycle",0]
["Walking",0]
["Metro/ tube",{"$f":"B21*C135","v":4.9749296200563044E-3}]
[]
["Bottle 1.5L","43g","Hellopro"]
["Electricity tube per passenger.km",0.13,"Defra","kwh"]
[]
["Activity","Fuel","Unit","kg CO2e","kg CO2","kg CH4","kg N2O"]
[null,"Diesel (average biofuel blend)","litres",2.6001627112482195,2.5784260580568197,5.1681028354095204E-4,2.1219842907858805E-2]
[null,"Diesel (100% mineral diesel)","litres",2.6719320747436055,2.6501954215522057,5.1681028354095204E-4,2.1219842907858805E-2]
[null,"Petrol (average biofuel blend)","litres",2.1983536074047074,2.1875970494793395,7.0381261827501228E-3,3.7184317426179358E-3]
[null,"Petrol (100% mineral petrol)","litres",2.3007492533234681,2.2899926953981002,7.0381261827501228E-3,3.7184317426179358E-3]
[null,"CNG","litres",0.49245136401268447,0.4914996670080708,6.9351726788913865E-4,2.5817973672455651E-4]
[null,"LNG","litres",1.2733066942797273,1.2708459392581017,1.7931926771535584E-3,6.675623444720272E-4]
[null,"LPG","litres",1.508071357441644,1.5058341114013103,1.0882549760583874E-3,1.1489910642751722E-3]
{"$rows_left_out":363}
{"sheet":"ideas","index":10,"n_rows":6,"n_cols":1,"rows_kept":6,"cut":false,"hidden":true,"merged":[]}
["ideas pour la v2"]
["rajouter helicopter dans transport"]
["rajouter d'autres modes de transport - sources hybrides"]
["add international transport in what if analysis"]
["transport dans benevolat"]
["electronics"]

{"sheet":"Feuil1","index":11,"n_rows":0,"n_cols":0,"rows_kept":0,"cut":false,"hidden":true,"merged":[]}

{"sheet":"Feuil2","index":12,"n_rows":28,"n_cols":9,"rows_kept":28,"cut":false,"hidden":true,"merged":[]}
[]
[null,null,"cab"]
[null,null,"km","person"]
[null,null,9,2]
[null,null,9,4]
[null,null,13,4]
[null,null,70,4]
[null,null,3.5,2]
[null,null,12,5]
[null,null,{"$f":"SUM(C4:C9)*2","v":233}]
[null,null,{"$f":"SUMPRODUCT(C4:C9,D4:D9)/SUM(C4:C9)","v":3.8884120171673819}]
[]
[]
[null,null,"Jeepney/trycicle",null,"consumtion"]
[null,"Jeepney",3,15,15,null,"Huts nuts",2,4]
[null,"Jeepney",32,25,15,null,"boat tour",50,20]
[null,"Jeepney",8,25,15,null,"Talibon",120,60]
[null,"Trycicle",3,2,7,null,"Sibulan",5]
[null,"Trycicle",1,2,7,null,"Siquijor",20]
[null,"jeepney",6,15,15,null,"Apo",15]
[null,"Trycicle",6,4,7,null,null,200]
[null,"jeepney",20,15,15,null,null,1000]
[null,"jeepney",6,20,15,null,null,{"$f":"SUM(H15:H22)*2","v":2824}]
[null,"Trycicle",3,1,7]
[null,"Trycicle",3,2,7]
[null,"jeepney",5,15,15]
[]
[null,null,{"$f":"SUM(C15:C26)*2-3","v":189},{"$f":"SUMPRODUCT(C15:C26,D15:D26)/SUM(C15:C26)","v":17.40625},{"$f":"SUM(E15:E26)","v":140}]